﻿2026-07-31T04:35:59.7818051Z Current runner version: '2.336.0'
2026-07-31T04:35:59.7822865Z Runner name: 'hfenduleam'
2026-07-31T04:35:59.7823305Z Runner group name: 'Default'
2026-07-31T04:35:59.7823825Z Machine name: 'HFENDULEAM'
2026-07-31T04:35:59.7827114Z ##[group]GITHUB_TOKEN Permissions
2026-07-31T04:35:59.7828609Z Actions: write
2026-07-31T04:35:59.7828963Z ArtifactMetadata: write
2026-07-31T04:35:59.7829302Z Attestations: write
2026-07-31T04:35:59.7829612Z Checks: write
2026-07-31T04:35:59.7829922Z CodeQuality: write
2026-07-31T04:35:59.7830230Z Contents: write
2026-07-31T04:35:59.7830542Z CopilotRequests: write
2026-07-31T04:35:59.7830936Z Deployments: write
2026-07-31T04:35:59.7831279Z Discussions: write
2026-07-31T04:35:59.7831596Z Drives: write
2026-07-31T04:35:59.7831892Z Issues: write
2026-07-31T04:35:59.7832182Z Metadata: read
2026-07-31T04:35:59.7832491Z Models: read
2026-07-31T04:35:59.7832786Z Packages: write
2026-07-31T04:35:59.7833249Z Pages: write
2026-07-31T04:35:59.7833719Z PullRequests: write
2026-07-31T04:35:59.7834088Z RepositoryProjects: write
2026-07-31T04:35:59.7834430Z SecurityEvents: write
2026-07-31T04:35:59.7834744Z Statuses: write
2026-07-31T04:35:59.7835055Z VulnerabilityAlerts: read
2026-07-31T04:35:59.7835396Z ##[endgroup]
2026-07-31T04:35:59.7836772Z Secret source: Actions
2026-07-31T04:35:59.7837427Z Prepare workflow directory
2026-07-31T04:35:59.8532562Z Prepare all required actions
2026-07-31T04:35:59.8565894Z Getting action download info
2026-07-31T04:36:00.1802068Z Download action repository 'actions/checkout@v5' (SHA:fbc6f3992d24b796d5a048ff273f7fcc4a7b6c09)
2026-07-31T04:36:00.8124437Z Complete job name: unit (self-hosted, Windows, hfenduleam)
2026-07-31T04:36:01.5377393Z ##[group]Run $floorBytes = 32GB
2026-07-31T04:36:01.5378215Z [36;1m$floorBytes = 32GB[0m
2026-07-31T04:36:01.5378746Z [36;1m$drive = (Get-Item $env:GITHUB_WORKSPACE).PSDrive[0m
2026-07-31T04:36:01.5379265Z [36;1m$freeBytes = [int64]$drive.Free[0m
2026-07-31T04:36:01.5379979Z [36;1mWrite-Host "disk preflight: drive=$($drive.Root) free_bytes=$freeBytes floor_bytes=$floorBytes"[0m
2026-07-31T04:36:01.5380724Z [36;1mif ($freeBytes -lt $floorBytes) {[0m
2026-07-31T04:36:01.5381528Z [36;1m  Write-Error "RESOURCE=disk drive=$($drive.Root) free_bytes=$freeBytes floor_bytes=$floorBytes"[0m
2026-07-31T04:36:01.5382186Z [36;1m  exit 1[0m
2026-07-31T04:36:01.5382498Z [36;1m}[0m
2026-07-31T04:36:01.5390733Z shell: C:\Program Files\PowerShell\7\pwsh.EXE -command ". '{0}'"
2026-07-31T04:36:01.5391874Z ##[endgroup]
2026-07-31T04:36:02.9428313Z disk preflight: drive=C:\ free_bytes=65768321024 floor_bytes=34359738368
2026-07-31T04:36:03.0604686Z ##[group]Run actions/checkout@v5
2026-07-31T04:36:03.0605159Z with:
2026-07-31T04:36:03.0605501Z   repository: BigscreenVR/spt-bs-core
2026-07-31T04:36:03.0608503Z   token: ***
2026-07-31T04:36:03.0608809Z   ssh-strict: true
2026-07-31T04:36:03.0609132Z   ssh-user: git
2026-07-31T04:36:03.0609464Z   persist-credentials: true
2026-07-31T04:36:03.0609836Z   clean: true
2026-07-31T04:36:03.0610168Z   sparse-checkout-cone-mode: true
2026-07-31T04:36:03.0610528Z   fetch-depth: 1
2026-07-31T04:36:03.0610812Z   fetch-tags: false
2026-07-31T04:36:03.0611134Z   show-progress: true
2026-07-31T04:36:03.0611446Z   lfs: false
2026-07-31T04:36:03.0611714Z   submodules: false
2026-07-31T04:36:03.0612030Z   set-safe-directory: true
2026-07-31T04:36:03.0612358Z   allow-unsafe-pr-checkout: false
2026-07-31T04:36:03.0612702Z ##[endgroup]
2026-07-31T04:36:03.2672597Z Syncing repository: BigscreenVR/spt-bs-core
2026-07-31T04:36:03.2674591Z ##[group]Getting Git version info
2026-07-31T04:36:03.2675236Z Working directory is 'C:\actions-runner\_work\spt-bs-core\spt-bs-core'
2026-07-31T04:36:03.3891646Z [command]"C:\Program Files\Git\cmd\git.exe" version
2026-07-31T04:36:03.6458627Z git version 2.43.0.windows.1
2026-07-31T04:36:03.6499899Z ##[endgroup]
2026-07-31T04:36:03.6519777Z Copying 'C:\Users\decid\.gitconfig' to 'C:\actions-runner\_work\_temp\89e9b020-f560-4768-b33d-827677ac05f0\.gitconfig'
2026-07-31T04:36:03.6540636Z Temporarily overriding HOME='C:\actions-runner\_work\_temp\89e9b020-f560-4768-b33d-827677ac05f0' before making global git config changes
2026-07-31T04:36:03.6541613Z Adding repository directory to the temporary git global config as a safe directory
2026-07-31T04:36:03.6547182Z [command]"C:\Program Files\Git\cmd\git.exe" config --global --add safe.directory C:\actions-runner\_work\spt-bs-core\spt-bs-core
2026-07-31T04:36:04.1224798Z [command]"C:\Program Files\Git\cmd\git.exe" config --local --get remote.origin.url
2026-07-31T04:36:04.3139700Z https://github.com/BigscreenVR/spt-bs-core
2026-07-31T04:36:04.3171996Z ##[group]Removing previously created refs, to avoid conflicts
2026-07-31T04:36:04.3180301Z [command]"C:\Program Files\Git\cmd\git.exe" rev-parse --symbolic-full-name --verify --quiet HEAD
2026-07-31T04:36:04.3589964Z HEAD
2026-07-31T04:36:04.6226408Z ##[endgroup]
2026-07-31T04:36:04.6231986Z [command]"C:\Program Files\Git\cmd\git.exe" submodule status
2026-07-31T04:36:11.7035741Z ##[group]Cleaning the repository
2026-07-31T04:36:11.7044098Z [command]"C:\Program Files\Git\cmd\git.exe" clean -ffdx
2026-07-31T04:36:13.5510859Z Removing dist/
2026-07-31T04:36:13.5511280Z Removing target/
2026-07-31T04:36:13.5545236Z [command]"C:\Program Files\Git\cmd\git.exe" reset --hard HEAD
2026-07-31T04:36:13.7465344Z HEAD is now at 00f3f924 release: v0.47.0 (counter 82) — fast-follow: engine-room ceremony, roster access views, admin-key ceremonies
2026-07-31T04:36:13.7495295Z ##[endgroup]
2026-07-31T04:36:13.7501135Z ##[group]Disabling automatic garbage collection
2026-07-31T04:36:13.7507330Z [command]"C:\Program Files\Git\cmd\git.exe" config --local gc.auto 0
2026-07-31T04:36:13.7860641Z ##[endgroup]
2026-07-31T04:36:13.7861140Z ##[group]Setting up auth
2026-07-31T04:36:13.7869408Z [command]"C:\Program Files\Git\cmd\git.exe" config --local --name-only --get-regexp core\.sshCommand
2026-07-31T04:36:13.8239949Z [command]"C:\Program Files\Git\cmd\git.exe" submodule foreach --recursive "sh -c \"git config --local --name-only --get-regexp 'core\.sshCommand' && git config --local --unset-all 'core.sshCommand' || :\""
2026-07-31T04:36:14.6637342Z [command]"C:\Program Files\Git\cmd\git.exe" config --local --name-only --get-regexp http\.https\:\/\/github\.com\/\.extraheader
2026-07-31T04:36:14.6943756Z [command]"C:\Program Files\Git\cmd\git.exe" submodule foreach --recursive "sh -c \"git config --local --name-only --get-regexp 'http\.https\:\/\/github\.com\/\.extraheader' && git config --local --unset-all 'http.https://github.com/.extraheader' || :\""
2026-07-31T04:36:15.5516354Z [command]"C:\Program Files\Git\cmd\git.exe" config --local --name-only --get-regexp ^includeIf\.gitdir:
2026-07-31T04:36:15.5775825Z [command]"C:\Program Files\Git\cmd\git.exe" submodule foreach --recursive "git config --local --show-origin --name-only --get-regexp remote.origin.url"
2026-07-31T04:36:16.3434249Z [command]"C:\Program Files\Git\cmd\git.exe" config --local http.https://github.com/.extraheader "AUTHORIZATION: basic ***"
2026-07-31T04:36:16.3782820Z ##[endgroup]
2026-07-31T04:36:16.3783217Z ##[group]Fetching the repository
2026-07-31T04:36:16.3790049Z [command]"C:\Program Files\Git\cmd\git.exe" -c protocol.version=2 fetch --no-tags --prune --no-recurse-submodules --depth=1 origin +9a720c13b63c08c8b2b5ebdaf081631e1b9bb1ee:refs/remotes/origin/main
2026-07-31T04:36:17.4084988Z From https://github.com/BigscreenVR/spt-bs-core
2026-07-31T04:36:17.4085449Z  + 00f3f924...9a720c13 9a720c13b63c08c8b2b5ebdaf081631e1b9bb1ee -> origin/main  (forced update)
2026-07-31T04:36:17.4245940Z ##[endgroup]
2026-07-31T04:36:17.4246497Z ##[group]Determining the checkout info
2026-07-31T04:36:17.4247157Z ##[endgroup]
2026-07-31T04:36:17.4252819Z [command]"C:\Program Files\Git\cmd\git.exe" sparse-checkout disable
2026-07-31T04:36:17.4587509Z [command]"C:\Program Files\Git\cmd\git.exe" config --local --unset-all extensions.worktreeConfig
2026-07-31T04:36:17.4870814Z ##[group]Checking out the ref
2026-07-31T04:36:17.4875516Z [command]"C:\Program Files\Git\cmd\git.exe" checkout --progress --force -B main refs/remotes/origin/main
2026-07-31T04:36:17.6347876Z branch 'main' set up to track 'origin/main'.
2026-07-31T04:36:17.6348187Z Your branch is up to date with 'origin/main'.
2026-07-31T04:36:17.6348853Z Previous HEAD position was 00f3f924 release: v0.47.0 (counter 82) — fast-follow: engine-room ceremony, roster access views, admin-key ceremonies
2026-07-31T04:36:17.6349333Z Switched to and reset branch 'main'
2026-07-31T04:36:17.6374274Z ##[endgroup]
2026-07-31T04:36:17.6689294Z [command]"C:\Program Files\Git\cmd\git.exe" log -1 --format=%H
2026-07-31T04:36:17.8531581Z 9a720c13b63c08c8b2b5ebdaf081631e1b9bb1ee
2026-07-31T04:36:17.9048077Z ##[group]Run cargo build -p spt --bin translate_proof_fixture
2026-07-31T04:36:17.9048719Z [36;1mcargo build -p spt --bin translate_proof_fixture[0m
2026-07-31T04:36:17.9055799Z shell: C:\Program Files\PowerShell\7\pwsh.EXE -command ". '{0}'"
2026-07-31T04:36:17.9056165Z ##[endgroup]
2026-07-31T04:36:18.9759446Z    Compiling proc-macro2 v1.0.106
2026-07-31T04:36:18.9759837Z    Compiling unicode-ident v1.0.24
2026-07-31T04:36:18.9760141Z    Compiling quote v1.0.45
2026-07-31T04:36:18.9760389Z    Compiling cfg-if v1.0.4
2026-07-31T04:36:18.9760638Z    Compiling serde_core v1.0.228
2026-07-31T04:36:18.9760900Z    Compiling serde v1.0.228
2026-07-31T04:36:18.9761106Z    Compiling windows-link v0.2.1
2026-07-31T04:36:18.9761366Z    Compiling typenum v1.20.1
2026-07-31T04:36:18.9761588Z    Compiling getrandom v0.3.4
2026-07-31T04:36:18.9761827Z    Compiling portable-atomic v1.13.1
2026-07-31T04:36:18.9762054Z    Compiling pin-project-lite v0.2.17
2026-07-31T04:36:18.9762800Z    Compiling version_check v0.9.5
2026-07-31T04:36:18.9763058Z    Compiling find-msvc-tools v0.1.9
2026-07-31T04:36:18.9763338Z    Compiling memchr v2.8.1
2026-07-31T04:36:18.9763611Z    Compiling shlex v2.0.1
2026-07-31T04:36:18.9763971Z    Compiling critical-section v1.2.0
2026-07-31T04:36:19.2693124Z    Compiling windows-sys v0.61.2
2026-07-31T04:36:19.2714735Z    Compiling subtle v2.6.1
2026-07-31T04:36:19.3128393Z    Compiling smallvec v1.15.1
2026-07-31T04:36:19.3129025Z    Compiling equivalent v1.0.2
2026-07-31T04:36:19.3480490Z    Compiling futures-core v0.3.32
2026-07-31T04:36:19.3745943Z    Compiling bytes v1.11.1
2026-07-31T04:36:19.5469701Z    Compiling generic-array v0.14.7
2026-07-31T04:36:20.1952613Z    Compiling itoa v1.0.18
2026-07-31T04:36:20.2224945Z    Compiling semver v1.0.28
2026-07-31T04:36:20.3141005Z    Compiling stable_deref_trait v1.2.1
2026-07-31T04:36:20.3520735Z    Compiling log v0.4.32
2026-07-31T04:36:20.3530883Z    Compiling futures-io v0.3.32
2026-07-31T04:36:20.4411694Z    Compiling futures-sink v0.3.32
2026-07-31T04:36:22.1881623Z    Compiling slab v0.4.12
2026-07-31T04:36:22.3349868Z    Compiling rustversion v1.0.22
2026-07-31T04:36:22.6481240Z    Compiling futures-task v0.3.32
2026-07-31T04:36:23.3083246Z    Compiling hashbrown v0.17.1
2026-07-31T04:36:23.9903194Z    Compiling rand_core v0.10.1
2026-07-31T04:36:24.0208268Z    Compiling futures-channel v0.3.32
2026-07-31T04:36:24.0352890Z    Compiling getrandom v0.2.17
2026-07-31T04:36:24.0782045Z    Compiling cpufeatures v0.2.17
2026-07-31T04:36:24.3107833Z    Compiling rustc_version v0.4.1
2026-07-31T04:36:24.3871524Z    Compiling getrandom v0.4.2
2026-07-31T04:36:24.4015214Z    Compiling fnv v1.0.7
2026-07-31T04:36:24.6131838Z    Compiling jobserver v0.1.34
2026-07-31T04:36:24.9320633Z    Compiling libc v0.2.186
2026-07-31T04:36:25.3056650Z    Compiling strsim v0.11.1
2026-07-31T04:36:25.3177252Z    Compiling cfg_aliases v0.2.1
2026-07-31T04:36:25.3185570Z    Compiling litemap v0.8.2
2026-07-31T04:36:25.3852727Z    Compiling writeable v0.6.3
2026-07-31T04:36:25.3953816Z    Compiling autocfg v1.5.1
2026-07-31T04:36:25.8282538Z    Compiling utf8_iter v1.0.4
2026-07-31T04:36:25.8314181Z    Compiling cc v1.2.63
2026-07-31T04:36:25.8710639Z    Compiling indexmap v2.14.0
2026-07-31T04:36:26.0354423Z    Compiling syn v2.0.117
2026-07-31T04:36:26.0926067Z    Compiling ident_case v1.0.1
2026-07-31T04:36:26.2605527Z    Compiling socket2 v0.6.4
2026-07-31T04:36:26.3026212Z    Compiling mio v1.2.1
2026-07-31T04:36:26.6003993Z    Compiling crypto-common v0.1.7
2026-07-31T04:36:26.7236101Z    Compiling fs_extra v1.3.0
2026-07-31T04:36:26.7366194Z    Compiling icu_properties_data v2.2.0
2026-07-31T04:36:26.8374519Z    Compiling dunce v1.0.5
2026-07-31T04:36:27.1089353Z    Compiling icu_normalizer_data v2.2.0
2026-07-31T04:36:27.1894416Z    Compiling percent-encoding v2.3.2
2026-07-31T04:36:27.7172200Z    Compiling http v1.4.1
2026-07-31T04:36:27.9346471Z    Compiling cmake v0.1.58
2026-07-31T04:36:28.5084878Z    Compiling ring v0.17.14
2026-07-31T04:36:29.4011754Z    Compiling aws-lc-rs v1.17.0
2026-07-31T04:36:29.8152086Z    Compiling unicode-segmentation v1.13.3
2026-07-31T04:36:30.8238208Z    Compiling synstructure v0.13.2
2026-07-31T04:36:31.4352032Z    Compiling serde_derive v1.0.228
2026-07-31T04:36:31.4437524Z    Compiling zeroize_derive v1.4.3
2026-07-31T04:36:31.5347463Z    Compiling tokio-macros v2.7.0
2026-07-31T04:36:31.9651662Z    Compiling futures-macro v0.3.32
2026-07-31T04:36:32.2749447Z    Compiling zerovec-derive v0.11.3
2026-07-31T04:36:32.5333873Z    Compiling displaydoc v0.2.6
2026-07-31T04:36:32.6925672Z    Compiling tracing-attributes v0.1.31
2026-07-31T04:36:32.7643508Z    Compiling aws-lc-sys v0.41.0
2026-07-31T04:36:33.0308909Z    Compiling cpufeatures v0.3.0
2026-07-31T04:36:34.6594437Z    Compiling thiserror v2.0.18
2026-07-31T04:36:35.0475276Z    Compiling thiserror-impl v2.0.18
2026-07-31T04:36:35.2100762Z    Compiling curve25519-dalek-derive v0.1.1
2026-07-31T04:36:35.2369328Z    Compiling zerofrom-derive v0.1.7
2026-07-31T04:36:35.3962384Z    Compiling zeroize v1.8.2
2026-07-31T04:36:35.4189543Z    Compiling yoke-derive v0.8.2
2026-07-31T04:36:35.5683976Z    Compiling tokio v1.52.3
2026-07-31T04:36:35.6599832Z    Compiling futures-util v0.3.32
2026-07-31T04:36:35.6642013Z    Compiling scopeguard v1.2.0
2026-07-31T04:36:35.8328662Z    Compiling chacha20 v0.10.0
2026-07-31T04:36:36.2660140Z    Compiling form_urlencoded v1.2.2
2026-07-31T04:36:37.4748132Z    Compiling rustls-pki-types v1.14.1
2026-07-31T04:36:37.6724476Z    Compiling block-buffer v0.10.4
2026-07-31T04:36:37.6801524Z    Compiling bitflags v2.12.1
2026-07-31T04:36:38.1736457Z    Compiling zerofrom v0.1.8
2026-07-31T04:36:38.8063394Z    Compiling lock_api v0.4.14
2026-07-31T04:36:38.9040666Z    Compiling winapi v0.3.9
2026-07-31T04:36:39.8376856Z    Compiling untrusted v0.9.0
2026-07-31T04:36:39.8482083Z    Compiling rand v0.10.1
2026-07-31T04:36:39.9244796Z    Compiling digest v0.10.7
2026-07-31T04:36:39.9532541Z    Compiling darling_core v0.20.11
2026-07-31T04:36:39.9627911Z    Compiling num-traits v0.2.19
2026-07-31T04:36:40.4759455Z    Compiling windows-strings v0.5.1
2026-07-31T04:36:40.6896977Z    Compiling windows-result v0.4.1
2026-07-31T04:36:41.4445076Z    Compiling yoke v0.8.3
2026-07-31T04:36:41.4800023Z    Compiling ipnet v2.12.0
2026-07-31T04:36:41.5765876Z    Compiling rustls v0.23.40
2026-07-31T04:36:42.0055029Z    Compiling heck v0.5.0
2026-07-31T04:36:42.0492063Z    Compiling convert_case v0.10.0
2026-07-31T04:36:42.5929623Z    Compiling unicode-xid v0.2.6
2026-07-31T04:36:42.7043550Z    Compiling anyhow v1.0.102
2026-07-31T04:36:42.8298400Z    Compiling const-oid v0.10.2
2026-07-31T04:36:43.0827249Z    Compiling once_cell v1.21.4
2026-07-31T04:36:43.1676977Z    Compiling zerovec v0.11.6
2026-07-31T04:36:43.1867119Z    Compiling zerotrie v0.2.4
2026-07-31T04:36:43.6674153Z    Compiling atomic-waker v1.1.2
2026-07-31T04:36:43.7184010Z    Compiling parking_lot_core v0.9.12
2026-07-31T04:36:43.7305487Z    Compiling httparse v1.10.1
2026-07-31T04:36:43.9612675Z    Compiling tokio-util v0.7.18
2026-07-31T04:36:44.6858225Z    Compiling darling_macro v0.20.11
2026-07-31T04:36:44.7584854Z    Compiling derive_more-impl v2.1.1
2026-07-31T04:36:44.9422504Z    Compiling tracing-core v0.1.36
2026-07-31T04:36:45.0551158Z    Compiling zerocopy v0.8.50
2026-07-31T04:36:45.1351707Z    Compiling http-body v1.0.1
2026-07-31T04:36:47.3943696Z    Compiling tinystr v0.8.3
2026-07-31T04:36:47.5712343Z    Compiling potential_utf v0.1.5
2026-07-31T04:36:48.5960430Z    Compiling tracing v0.1.44
2026-07-31T04:36:48.5960929Z    Compiling icu_locale_core v2.2.0
2026-07-31T04:36:48.9772922Z    Compiling icu_collections v2.2.0
2026-07-31T04:36:49.3155159Z    Compiling curve25519-dalek v4.1.3
2026-07-31T04:36:49.7473839Z    Compiling hybrid-array v0.4.12
2026-07-31T04:36:49.8595361Z    Compiling ahash v0.8.12
2026-07-31T04:36:50.1256254Z    Compiling h2 v0.4.14
2026-07-31T04:36:50.4392429Z    Compiling either v1.16.0
2026-07-31T04:36:50.6279701Z    Compiling icu_provider v2.2.0
2026-07-31T04:36:50.7468521Z    Compiling darling v0.20.11
2026-07-31T04:36:51.3934566Z    Compiling powerfmt v0.2.0
2026-07-31T04:36:51.6313455Z    Compiling base64ct v1.8.3
2026-07-31T04:36:53.1900669Z    Compiling uuid v1.23.2
2026-07-31T04:36:53.3589351Z    Compiling derive_more v2.1.1
2026-07-31T04:36:53.9706211Z    Compiling windows-implement v0.60.2
2026-07-31T04:36:54.5751279Z    Compiling icu_normalizer v2.2.0
2026-07-31T04:36:54.6993225Z    Compiling icu_properties v2.2.0
2026-07-31T04:36:55.4002629Z    Compiling derive_builder_core v0.20.2
2026-07-31T04:36:56.5548426Z    Compiling deranged v0.5.8
2026-07-31T04:36:57.0823502Z    Compiling pem-rfc7468 v1.0.0
2026-07-31T04:36:57.6236431Z    Compiling spez v0.1.2
2026-07-31T04:36:58.2842431Z    Compiling windows-interface v0.59.3
2026-07-31T04:36:59.1662618Z    Compiling n0-error-macros v0.1.3
2026-07-31T04:36:59.5304182Z    Compiling rand_core v0.6.4
2026-07-31T04:36:59.5533192Z    Compiling num-conv v0.2.2
2026-07-31T04:36:59.6226760Z    Compiling data-encoding v2.11.0
2026-07-31T04:36:59.8789391Z    Compiling tinyvec_macros v0.1.1
2026-07-31T04:37:00.4473412Z    Compiling pkg-config v0.3.33
2026-07-31T04:37:00.4774125Z    Compiling time-core v0.1.8
2026-07-31T04:37:00.4921024Z    Compiling vcpkg v0.2.15
2026-07-31T04:37:00.8504953Z    Compiling derive_builder_macro v0.20.2
2026-07-31T04:37:00.9617970Z    Compiling try-lock v0.2.5
2026-07-31T04:37:01.0219656Z    Compiling idna_adapter v1.2.2
2026-07-31T04:37:01.1468729Z    Compiling fastrand v2.4.1
2026-07-31T04:37:01.1469139Z    Compiling base64 v0.22.1
2026-07-31T04:37:01.3215114Z    Compiling idna v1.1.0
2026-07-31T04:37:01.3481707Z    Compiling tower-service v0.3.3
2026-07-31T04:37:01.4969069Z    Compiling zmij v1.0.21
2026-07-31T04:37:01.5284996Z    Compiling want v0.3.1
2026-07-31T04:37:01.6602164Z    Compiling tinyvec v1.11.0
2026-07-31T04:37:01.6948064Z    Compiling der v0.8.0-rc.10
2026-07-31T04:37:01.7973160Z    Compiling url v2.5.8
2026-07-31T04:37:02.1272590Z    Compiling libsqlite3-sys v0.30.1
2026-07-31T04:37:02.1606786Z    Compiling parking_lot v0.12.5
2026-07-31T04:37:02.1850799Z    Compiling crypto-common v0.2.2
2026-07-31T04:37:02.2582435Z    Compiling block-buffer v0.12.0
2026-07-31T04:37:02.3730314Z    Compiling sha2 v0.10.9
2026-07-31T04:37:02.4099108Z    Compiling windows-core v0.62.2
2026-07-31T04:37:02.4695204Z    Compiling derive_builder v0.20.2
2026-07-31T04:37:02.6606161Z    Compiling pin-project-internal v1.1.13
2026-07-31T04:37:02.6689866Z    Compiling vergen-lib v9.1.0
2026-07-31T04:37:02.7245398Z    Compiling n0-error v0.1.3
2026-07-31T04:37:02.9234066Z    Compiling inout v0.1.4
2026-07-31T04:37:03.0450964Z    Compiling n0-future v0.3.2
2026-07-31T04:37:03.0911162Z    Compiling httpdate v1.0.3
2026-07-31T04:37:03.1509150Z    Compiling windows_x86_64_msvc v0.52.6
2026-07-31T04:37:03.2316503Z    Compiling diatomic-waker v0.2.3
2026-07-31T04:37:03.3067507Z    Compiling crossbeam-utils v0.8.21
2026-07-31T04:37:03.5008206Z    Compiling signature v2.2.0
2026-07-31T04:37:03.5422382Z    Compiling winnow v1.0.3
2026-07-31T04:37:03.5852005Z    Compiling spin v0.10.0
2026-07-31T04:37:03.5890125Z    Compiling parking v2.2.1
2026-07-31T04:37:03.6380282Z    Compiling cordyceps v0.3.4
2026-07-31T04:37:03.6963198Z    Compiling serde_json v1.0.150
2026-07-31T04:37:03.8288799Z    Compiling ed25519 v2.2.3
2026-07-31T04:37:03.8643373Z    Compiling futures-lite v2.6.1
2026-07-31T04:37:03.9432288Z    Compiling hyper v1.10.1
2026-07-31T04:37:04.1521722Z    Compiling futures-buffered v0.2.13
2026-07-31T04:37:04.1665038Z    Compiling cipher v0.4.4
2026-07-31T04:37:04.1775070Z    Compiling digest v0.11.3
2026-07-31T04:37:04.1957444Z    Compiling spki v0.8.0-rc.4
2026-07-31T04:37:04.2848430Z    Compiling universal-hash v0.5.1
2026-07-31T04:37:04.4857407Z    Compiling vergen-lib v0.1.6
2026-07-31T04:37:04.6107788Z    Compiling vergen v9.1.0
2026-07-31T04:37:04.8262319Z    Compiling heapless v0.7.17
2026-07-31T04:37:04.8262755Z    Compiling curve25519-dalek v5.0.0-pre.6
2026-07-31T04:37:04.8552514Z    Compiling noq-udp v0.10.0
2026-07-31T04:37:04.8781833Z    Compiling sync_wrapper v1.0.2
2026-07-31T04:37:04.9100956Z    Compiling toml_datetime v1.1.1+spec-1.1.0
2026-07-31T04:37:04.9506102Z    Compiling toml_parser v1.1.2+spec-1.1.0
2026-07-31T04:37:04.9703974Z    Compiling byteorder v1.5.0
2026-07-31T04:37:05.0269444Z    Compiling hashbrown v0.14.5
2026-07-31T04:37:05.0330937Z    Compiling pin-project v1.1.13
2026-07-31T04:37:05.0720256Z    Compiling opaque-debug v0.3.1
2026-07-31T04:37:05.1355806Z    Compiling allocator-api2 v0.2.21
2026-07-31T04:37:05.5414921Z    Compiling pkcs8 v0.11.0-rc.10
2026-07-31T04:37:05.5903391Z    Compiling polyval v0.6.2
2026-07-31T04:37:05.7309031Z    Compiling hash32 v0.2.1
2026-07-31T04:37:05.7365650Z    Compiling hashlink v0.9.1
2026-07-31T04:37:05.9490991Z    Compiling toml_edit v0.25.12+spec-1.1.0
2026-07-31T04:37:06.0484732Z    Compiling hyper-util v0.1.20
2026-07-31T04:37:07.1508600Z    Compiling ed25519-dalek v2.2.0
2026-07-31T04:37:07.4054327Z    Compiling prefix-trie v0.8.4
2026-07-31T04:37:07.4773126Z    Compiling futures-executor v0.3.32
2026-07-31T04:37:07.6801041Z    Compiling spin v0.9.8
2026-07-31T04:37:07.7764879Z    Compiling vergen-gitcl v1.0.8
2026-07-31T04:37:08.2673283Z    Compiling windows-threading v0.2.1
2026-07-31T04:37:08.2704370Z    Compiling signature v3.0.0
2026-07-31T04:37:08.2713208Z    Compiling ryu v1.0.23
2026-07-31T04:37:08.4630948Z    Compiling fallible-streaming-iterator v0.1.9
2026-07-31T04:37:09.1331233Z    Compiling fallible-iterator v0.3.0
2026-07-31T04:37:09.1726019Z    Compiling tower-layer v0.3.3
2026-07-31T04:37:09.3657443Z    Compiling futures v0.3.32
2026-07-31T04:37:09.4831767Z    Compiling proc-macro-crate v3.5.0
2026-07-31T04:37:09.6285184Z    Compiling windows-future v0.3.2
2026-07-31T04:37:09.6619618Z    Compiling windows-targets v0.52.6
2026-07-31T04:37:09.7554894Z    Compiling ed25519 v3.0.0-rc.4
2026-07-31T04:37:09.7711799Z    Compiling hickory-proto v0.26.0-beta.4
2026-07-31T04:37:09.8917360Z    Compiling spt-proto v0.47.0 (C:\actions-runner\_work\spt-bs-core\spt-bs-core\crates\spt-proto)
2026-07-31T04:37:10.6973474Z    Compiling rusqlite v0.32.1
2026-07-31T04:37:10.7061054Z    Compiling ghash v0.5.1
2026-07-31T04:37:10.9180115Z    Compiling ctr v0.9.2
2026-07-31T04:37:10.9343048Z    Compiling data-encoding-macro-internal v0.1.18
2026-07-31T04:37:11.4856935Z    Compiling aes v0.8.4
2026-07-31T04:37:11.5463672Z    Compiling sha2 v0.11.0-rc.5
2026-07-31T04:37:11.6077770Z    Compiling windows-numerics v0.3.1
2026-07-31T04:37:11.8195069Z    Compiling windows-collections v0.3.2
2026-07-31T04:37:12.2226891Z    Compiling time v0.3.47
2026-07-31T04:37:13.3873093Z    Compiling fs2 v0.4.3
2026-07-31T04:37:13.4351616Z    Compiling http-body-util v0.1.3
2026-07-31T04:37:13.5272404Z    Compiling cobs v0.3.0
2026-07-31T04:37:13.6796624Z    Compiling aead v0.5.2
2026-07-31T04:37:13.9836932Z    Compiling postcard-derive v0.2.2
2026-07-31T04:37:13.9974407Z    Compiling widestring v1.2.1
2026-07-31T04:37:14.4486999Z    Compiling arrayvec v0.7.6
2026-07-31T04:37:14.4548045Z    Compiling utf8parse v0.2.2
2026-07-31T04:37:14.4849962Z    Compiling ipconfig v0.3.4
2026-07-31T04:37:14.5060520Z    Compiling aes-gcm v0.10.3
2026-07-31T04:37:14.5064145Z    Compiling num_enum_derive v0.7.6
2026-07-31T04:37:14.6566968Z    Compiling windows v0.62.2
2026-07-31T04:37:14.7388203Z    Compiling data-encoding-macro v0.1.20
2026-07-31T04:37:14.9498643Z    Compiling ed25519-dalek v3.0.0-pre.6
2026-07-31T04:37:15.0150334Z    Compiling spt-store v0.47.0 (C:\actions-runner\_work\spt-bs-core\spt-bs-core\crates\spt-store)
2026-07-31T04:37:15.0651008Z    Compiling windows-sys v0.59.0
2026-07-31T04:37:15.8190464Z    Compiling tower v0.5.3
2026-07-31T04:37:15.8459037Z    Compiling postcard v1.1.3
2026-07-31T04:37:15.8647260Z    Compiling crossbeam-channel v0.5.15
2026-07-31T04:37:15.8840977Z    Compiling crossbeam-epoch v0.9.18
2026-07-31T04:37:16.0758720Z    Compiling chrono v0.4.45
2026-07-31T04:37:16.3115110Z    Compiling iroh-metrics-derive v0.4.1
2026-07-31T04:37:16.6794147Z    Compiling strum_macros v0.28.0
2026-07-31T04:37:16.9243159Z    Compiling windows-registry v0.6.1
2026-07-31T04:37:17.4335047Z    Compiling enum-assoc v1.3.0
2026-07-31T04:37:17.5049005Z    Compiling async-trait v0.1.89
2026-07-31T04:37:17.6663832Z    Compiling blake3 v1.8.5
2026-07-31T04:37:17.8323513Z    Compiling memoffset v0.6.5
2026-07-31T04:37:17.8985836Z    Compiling acto v0.8.2
2026-07-31T04:37:17.9327866Z    Compiling netwatch v0.16.0
2026-07-31T04:37:18.8104571Z    Compiling noq v0.18.0
2026-07-31T04:37:18.9039039Z    Compiling ref-cast v1.0.25
2026-07-31T04:37:18.9439889Z    Compiling xml-rs v0.8.28
2026-07-31T04:37:19.2923042Z    Compiling lru-slab v0.1.2
2026-07-31T04:37:19.4238451Z    Compiling mac-addr v0.3.0
2026-07-31T04:37:19.4788288Z    Compiling foldhash v0.2.0
2026-07-31T04:37:21.7308820Z    Compiling rustc-hash v2.1.2
2026-07-31T04:37:21.8877407Z    Compiling identity-hash v0.1.0
2026-07-31T04:37:22.0405613Z    Compiling thiserror v1.0.69
2026-07-31T04:37:22.6385713Z    Compiling sorted-index-buffer v0.2.1
2026-07-31T04:37:25.3321596Z    Compiling tagptr v0.2.0
2026-07-31T04:37:25.9055298Z    Compiling wmi v0.18.4
2026-07-31T04:37:25.9055666Z    Compiling xmltree v0.10.3
2026-07-31T04:37:25.9124068Z    Compiling hashbrown v0.16.1
2026-07-31T04:37:25.9205569Z    Compiling netdev v0.42.0
2026-07-31T04:37:28.4736575Z    Compiling moka v0.12.15
2026-07-31T04:37:41.4707818Z    Compiling strum v0.28.0
2026-07-31T04:37:41.7427437Z    Compiling spt-msg v0.47.0 (C:\actions-runner\_work\spt-bs-core\spt-bs-core\crates\spt-msg)
2026-07-31T04:37:43.8354844Z    Compiling iroh-metrics v0.38.3
2026-07-31T04:37:53.9307594Z    Compiling iroh-relay v0.98.0
2026-07-31T04:38:00.1075199Z    Compiling num_enum v0.7.6
2026-07-31T04:38:07.4441578Z    Compiling tower-http v0.6.11
2026-07-31T04:38:10.6458103Z    Compiling iroh-base v0.98.0
2026-07-31T04:38:16.2934579Z    Compiling n0-watcher v0.6.1
2026-07-31T04:38:19.0996128Z    Compiling attohttpc v0.30.1
2026-07-31T04:38:31.2000554Z    Compiling tokio-stream v0.1.18
2026-07-31T04:38:33.6919360Z    Compiling serde_spanned v0.6.9
2026-07-31T04:38:36.2171944Z    Compiling toml_datetime v0.6.11
2026-07-31T04:38:40.5817789Z    Compiling simple-dns v0.9.3
2026-07-31T04:38:43.9080490Z    Compiling serial-core v0.4.0
2026-07-31T04:38:45.7091228Z    Compiling thiserror-impl v1.0.69
2026-07-31T04:38:47.8442305Z    Compiling ref-cast-impl v1.0.25
2026-07-31T04:38:50.3052354Z    Compiling serde_derive_internals v0.29.1
2026-07-31T04:39:02.9460348Z    Compiling aho-corasick v1.1.4
2026-07-31T04:39:07.9644082Z    Compiling constant_time_eq v0.4.2
2026-07-31T04:39:13.4851455Z    Compiling winnow v0.7.15
2026-07-31T04:39:16.2239570Z    Compiling smol_str v0.1.24
2026-07-31T04:39:17.1512054Z    Compiling toml_write v0.1.2
2026-07-31T04:39:17.7104554Z    Compiling winreg v0.10.1
2026-07-31T04:39:18.2309099Z    Compiling sha1_smol v1.0.1
2026-07-31T04:39:18.5156356Z    Compiling resolv-conf v0.7.6
2026-07-31T04:39:18.6966619Z    Compiling arrayref v0.3.9
2026-07-31T04:39:18.6967533Z    Compiling regex-syntax v0.8.10
2026-07-31T04:39:18.7097804Z    Compiling simdutf8 v0.1.5
2026-07-31T04:39:19.3428758Z    Compiling schemars_derive v1.2.1
2026-07-31T04:39:19.5321006Z    Compiling toml_edit v0.22.27
2026-07-31T04:39:19.7708580Z    Compiling serial-windows v0.4.0
2026-07-31T04:39:19.8168209Z    Compiling iroh-dns v0.98.0
2026-07-31T04:39:20.5171251Z    Compiling igd-next v0.17.1
2026-07-31T04:39:21.1090427Z    Compiling lru v0.16.4
2026-07-31T04:39:21.1254969Z    Compiling hmac v0.12.1
2026-07-31T04:39:22.0167104Z    Compiling regex-automata v0.4.14
2026-07-31T04:39:22.9539424Z    Compiling webpki-roots v1.0.7
2026-07-31T04:39:22.9715237Z    Compiling seize v0.5.1
2026-07-31T04:39:23.8273093Z    Compiling darling_core v0.23.0
2026-07-31T04:39:23.9217887Z    Compiling serde_bytes v0.11.19
2026-07-31T04:39:24.3538012Z    Compiling iroh v0.98.2
2026-07-31T04:39:24.3711966Z    Compiling pin-utils v0.1.0
2026-07-31T04:39:24.3834196Z    Compiling lazy_static v1.5.0
2026-07-31T04:39:24.4110574Z    Compiling once_cell_polyfill v1.70.2
2026-07-31T04:39:24.9032602Z    Compiling dyn-clone v1.0.20
2026-07-31T04:39:25.1579578Z    Compiling anstyle v1.0.14
2026-07-31T04:39:25.1828991Z    Compiling bitflags v1.3.2
2026-07-31T04:39:25.3796139Z    Compiling cmov v0.5.4
2026-07-31T04:39:25.5522610Z    Compiling portmapper v0.16.0
2026-07-31T04:39:25.5566854Z    Compiling schemars v1.2.1
2026-07-31T04:39:25.6214970Z    Compiling nix v0.25.1
2026-07-31T04:39:25.6320151Z    Compiling anstyle-wincon v3.0.11
2026-07-31T04:39:25.6590624Z    Compiling shared_library v0.1.9
2026-07-31T04:39:25.6913897Z    Compiling papaya v0.2.4
2026-07-31T04:39:25.7689669Z    Compiling hkdf v0.12.4
2026-07-31T04:39:25.8170565Z    Compiling swarm-discovery v0.6.0-alpha.2
2026-07-31T04:39:25.8605995Z    Compiling toml v0.8.23
2026-07-31T04:39:26.1735522Z    Compiling ctutils v0.4.2
2026-07-31T04:39:26.1908721Z    Compiling serial v0.4.0
2026-07-31T04:39:26.2295829Z    Compiling filedescriptor v0.8.3
2026-07-31T04:39:26.5651561Z    Compiling anstyle-parse v1.0.0
2026-07-31T04:39:26.5906625Z    Compiling backon v1.6.0
2026-07-31T04:39:26.5985965Z    Compiling anstyle-query v1.1.5
2026-07-31T04:39:26.8865847Z    Compiling vte_generate_state_changes v0.1.2
2026-07-31T04:39:26.9318446Z    Compiling colorchoice v1.0.5
2026-07-31T04:39:27.4540040Z    Compiling foldhash v0.1.5
2026-07-31T04:39:27.5072826Z    Compiling paste v1.0.15
2026-07-31T04:39:27.5414949Z    Compiling instability v0.3.12
2026-07-31T04:39:27.5624135Z    Compiling shell-words v1.1.1
2026-07-31T04:39:27.6314771Z    Compiling unicode-width v0.2.0
2026-07-31T04:39:27.6733173Z    Compiling regex v1.12.3
2026-07-31T04:39:27.8005275Z    Compiling downcast-rs v1.2.1
2026-07-31T04:39:27.8653161Z    Compiling is_terminal_polyfill v1.70.2
2026-07-31T04:39:28.4702729Z    Compiling vte v0.13.1
2026-07-31T04:39:28.6604801Z    Compiling anstream v1.0.0
2026-07-31T04:39:28.7098270Z    Compiling portable-pty v0.8.1
2026-07-31T04:39:28.7940659Z    Compiling hashbrown v0.15.5
2026-07-31T04:39:29.0129422Z    Compiling spake2 v0.4.0
2026-07-31T04:39:29.5506823Z    Compiling spt-runtime v0.47.0 (C:\actions-runner\_work\spt-bs-core\spt-bs-core\crates\spt-runtime)
2026-07-31T04:39:29.5907542Z    Compiling itertools v0.13.0
2026-07-31T04:39:29.5999871Z    Compiling crossterm_winapi v0.9.1
2026-07-31T04:39:29.6021071Z    Compiling strum_macros v0.26.4
2026-07-31T04:39:29.6175661Z    Compiling sha1 v0.10.6
2026-07-31T04:39:29.6260304Z    Compiling castaway v0.2.4
2026-07-31T04:39:29.8070551Z    Compiling terminal_size v0.4.4
2026-07-31T04:39:29.8649512Z    Compiling static_assertions v1.1.0
2026-07-31T04:39:29.9787762Z    Compiling doctest-file v1.1.1
2026-07-31T04:39:30.2654247Z    Compiling clap_lex v1.1.0
2026-07-31T04:39:30.3295865Z    Compiling unicode-width v0.1.14
2026-07-31T04:39:30.3414215Z    Compiling recvmsg v1.0.0
2026-07-31T04:39:30.4456017Z    Compiling darling_macro v0.23.0
2026-07-31T04:39:30.8221656Z    Compiling indoc v2.0.7
2026-07-31T04:39:30.9449970Z    Compiling crossterm v0.28.1
2026-07-31T04:39:31.4110286Z    Compiling clap_builder v4.6.0
2026-07-31T04:39:31.4674555Z    Compiling compact_str v0.8.2
2026-07-31T04:39:31.6300995Z    Compiling lru v0.12.5
2026-07-31T04:39:32.1543226Z    Compiling unicode-truncate v1.1.0
2026-07-31T04:39:32.1654662Z    Compiling interprocess v2.4.2
2026-07-31T04:39:32.5176038Z    Compiling darling v0.23.0
2026-07-31T04:39:32.6286955Z    Compiling spt-live v0.47.0 (C:\actions-runner\_work\spt-bs-core\spt-bs-core\crates\spt-live)
2026-07-31T04:39:32.6288047Z    Compiling spt-term v0.47.0 (C:\actions-runner\_work\spt-bs-core\spt-bs-core\crates\spt-term)
2026-07-31T04:39:32.7726372Z    Compiling strum v0.26.3
2026-07-31T04:39:32.9452826Z    Compiling clap_derive v4.6.1
2026-07-31T04:39:33.3220198Z    Compiling error-code v3.3.2
2026-07-31T04:39:33.8496589Z    Compiling cassowary v0.3.0
2026-07-31T04:39:33.9272528Z    Compiling nucleo-matcher v0.3.1
2026-07-31T04:39:33.9385071Z    Compiling qrcode v0.14.1
2026-07-31T04:39:36.8471929Z    Compiling clipboard-win v5.4.1
2026-07-31T04:39:38.5052808Z    Compiling ratatui v0.29.0
2026-07-31T04:39:38.9093102Z    Compiling clap v4.6.1
2026-07-31T04:40:08.2084125Z    Compiling rustls-webpki v0.103.13
2026-07-31T04:40:13.4073353Z    Compiling tokio-rustls v0.26.4
2026-07-31T04:40:13.4074145Z    Compiling rustls-platform-verifier v0.7.0
2026-07-31T04:40:13.4074518Z    Compiling noq-proto v0.17.0
2026-07-31T04:40:13.6863581Z    Compiling hickory-net v0.26.0-beta.4
2026-07-31T04:40:13.7069774Z    Compiling hyper-rustls v0.27.9
2026-07-31T04:40:13.7309008Z    Compiling tokio-websockets v0.13.2
2026-07-31T04:40:14.0145696Z    Compiling reqwest v0.13.4
2026-07-31T04:40:15.5686066Z    Compiling hickory-resolver v0.26.0-beta.4
2026-07-31T04:40:48.9425641Z    Compiling spt-net v0.47.0 (C:\actions-runner\_work\spt-bs-core\spt-bs-core\crates\spt-net)
2026-07-31T04:40:51.7705755Z    Compiling spt-daemon v0.47.0 (C:\actions-runner\_work\spt-bs-core\spt-bs-core\crates\spt-daemon)
2026-07-31T04:41:10.5684911Z    Compiling spt v0.47.0 (C:\actions-runner\_work\spt-bs-core\spt-bs-core\crates\spt)
2026-07-31T04:41:11.0355026Z     Finished `dev` profile [unoptimized + debuginfo] target(s) in 4m 52s
2026-07-31T04:41:11.4334726Z ##[group]Run cargo test --workspace --lib --bins
2026-07-31T04:41:11.4335140Z [36;1mcargo test --workspace --lib --bins[0m
2026-07-31T04:41:11.4340334Z shell: C:\Program Files\PowerShell\7\pwsh.EXE -command ". '{0}'"
2026-07-31T04:41:11.4340724Z ##[endgroup]
2026-07-31T04:41:18.6623124Z    Compiling fastrand v2.4.1
2026-07-31T04:41:19.2229212Z    Compiling futures-lite v2.6.1
2026-07-31T04:41:19.2955465Z    Compiling tempfile v3.27.0
2026-07-31T04:41:19.5675462Z    Compiling backon v1.6.0
2026-07-31T04:41:19.5729427Z    Compiling bytemuck v1.25.2
2026-07-31T04:41:19.5758951Z    Compiling mock-adapter v0.47.0 (C:\actions-runner\_work\spt-bs-core\spt-bs-core\adapters\mock)
2026-07-31T04:41:19.5759740Z    Compiling spt-proto v0.47.0 (C:\actions-runner\_work\spt-bs-core\spt-bs-core\crates\spt-proto)
2026-07-31T04:41:19.5868149Z    Compiling spt-test-support v0.47.0 (C:\actions-runner\_work\spt-bs-core\spt-bs-core\crates\spt-test-support)
2026-07-31T04:41:20.0095605Z    Compiling spt-store v0.47.0 (C:\actions-runner\_work\spt-bs-core\spt-bs-core\crates\spt-store)
2026-07-31T04:41:20.0109769Z    Compiling spt-runtime v0.47.0 (C:\actions-runner\_work\spt-bs-core\spt-bs-core\crates\spt-runtime)
2026-07-31T04:41:20.0133510Z    Compiling spt-live v0.47.0 (C:\actions-runner\_work\spt-bs-core\spt-bs-core\crates\spt-live)
2026-07-31T04:41:20.0878505Z    Compiling rgb v0.8.53
2026-07-31T04:41:20.2150149Z    Compiling n0-future v0.3.2
2026-07-31T04:41:20.2569068Z    Compiling spt-msg v0.47.0 (C:\actions-runner\_work\spt-bs-core\spt-bs-core\crates\spt-msg)
2026-07-31T04:41:20.4850182Z    Compiling n0-watcher v0.6.1
2026-07-31T04:41:20.4851885Z    Compiling iroh-dns v0.98.0
2026-07-31T04:41:20.9163116Z    Compiling netwatch v0.16.0
2026-07-31T04:41:21.0350192Z    Compiling avt v0.18.0
2026-07-31T04:41:21.8555958Z    Compiling iroh-relay v0.98.0
2026-07-31T04:41:24.0960805Z    Compiling portmapper v0.16.0
2026-07-31T04:41:25.6160345Z    Compiling spt-term v0.47.0 (C:\actions-runner\_work\spt-bs-core\spt-bs-core\crates\spt-term)
2026-07-31T04:41:33.7258387Z    Compiling iroh v0.98.2
2026-07-31T04:41:47.9299188Z    Compiling spt-net v0.47.0 (C:\actions-runner\_work\spt-bs-core\spt-bs-core\crates\spt-net)
2026-07-31T04:41:50.2279657Z    Compiling spt-daemon v0.47.0 (C:\actions-runner\_work\spt-bs-core\spt-bs-core\crates\spt-daemon)
2026-07-31T04:42:09.2924535Z    Compiling spt v0.47.0 (C:\actions-runner\_work\spt-bs-core\spt-bs-core\crates\spt)
2026-07-31T04:42:09.2927046Z    Compiling xtask v0.47.0 (C:\actions-runner\_work\spt-bs-core\spt-bs-core\crates\xtask)
2026-07-31T04:42:26.3960012Z     Finished `test` profile [unoptimized + debuginfo] target(s) in 1m 13s
2026-07-31T04:42:26.4317442Z      Running unittests src\capture_player.rs (target\debug\deps\capture_player-84a75d77b2d165f9.exe)
2026-07-31T04:42:26.5153441Z 
2026-07-31T04:42:26.5153728Z running 2 tests
2026-07-31T04:42:26.5159178Z test tests::parses_a_well_formed_record ... ok
2026-07-31T04:42:26.5159522Z test tests::refuses_a_length_mismatch ... ok
2026-07-31T04:42:26.5159732Z 
2026-07-31T04:42:26.5159972Z test result: ok. 2 passed; 0 failed; 0 ignored; 0 measured; 0 filtered out; finished in 0.00s
2026-07-31T04:42:26.5160331Z 
2026-07-31T04:42:26.5168679Z      Running unittests src\console_mode_probe.rs (target\debug\deps\console_mode_probe-d91fa02ff96577ea.exe)
2026-07-31T04:42:26.5937097Z 
2026-07-31T04:42:26.5937378Z running 0 tests
2026-07-31T04:42:26.5937540Z 
2026-07-31T04:42:26.5937794Z test result: ok. 0 passed; 0 failed; 0 ignored; 0 measured; 0 filtered out; finished in 0.00s
2026-07-31T04:42:26.5938144Z 
2026-07-31T04:42:26.5949082Z      Running unittests src\main.rs (target\debug\deps\mock_session-913c6f569abb0eba.exe)
2026-07-31T04:42:26.6720817Z 
2026-07-31T04:42:26.6721107Z running 0 tests
2026-07-31T04:42:26.6721227Z 
2026-07-31T04:42:26.6721399Z test result: ok. 0 passed; 0 failed; 0 ignored; 0 measured; 0 filtered out; finished in 0.00s
2026-07-31T04:42:26.6721606Z 
2026-07-31T04:42:26.6734235Z      Running unittests src\shell.rs (target\debug\deps\mock_shell-4153450c5e0c04ba.exe)
2026-07-31T04:42:26.7486527Z 
2026-07-31T04:42:26.7486779Z running 0 tests
2026-07-31T04:42:26.7486910Z 
2026-07-31T04:42:26.7487074Z test result: ok. 0 passed; 0 failed; 0 ignored; 0 measured; 0 filtered out; finished in 0.00s
2026-07-31T04:42:26.7487291Z 
2026-07-31T04:42:26.7499053Z      Running unittests tests\fixtures\gh_fixture.rs (target\debug\deps\gh_fixture-ecc23862a3fbe40c.exe)
2026-07-31T04:42:26.9818810Z 
2026-07-31T04:42:26.9819149Z running 0 tests
2026-07-31T04:42:26.9819267Z 
2026-07-31T04:42:26.9819437Z test result: ok. 0 passed; 0 failed; 0 ignored; 0 measured; 0 filtered out; finished in 0.00s
2026-07-31T04:42:26.9819707Z 
2026-07-31T04:42:26.9831273Z      Running unittests tests\fixtures\git_fixture.rs (target\debug\deps\git_fixture-b85d451740889423.exe)
2026-07-31T04:42:27.0697579Z 
2026-07-31T04:42:27.0697903Z running 0 tests
2026-07-31T04:42:27.0698020Z 
2026-07-31T04:42:27.0698211Z test result: ok. 0 passed; 0 failed; 0 ignored; 0 measured; 0 filtered out; finished in 0.00s
2026-07-31T04:42:27.0698426Z 
2026-07-31T04:42:27.0710018Z      Running unittests tests\fixtures\post_step_fixture.rs (target\debug\deps\post_step_fixture-fbadfeb8eba9ff1b.exe)
2026-07-31T04:42:27.1469770Z 
2026-07-31T04:42:27.1470080Z running 0 tests
2026-07-31T04:42:27.1470190Z 
2026-07-31T04:42:27.1470357Z test result: ok. 0 passed; 0 failed; 0 ignored; 0 measured; 0 filtered out; finished in 0.00s
2026-07-31T04:42:27.1470564Z 
2026-07-31T04:42:27.1482738Z      Running unittests src\main.rs (target\debug\deps\spt-b39679f88e654a40.exe)
2026-07-31T04:42:28.0053301Z 
2026-07-31T04:42:28.0053609Z running 475 tests
2026-07-31T04:42:28.0058392Z test accessview::tests::drill_matches_only_its_own_kind ... ok
2026-07-31T04:42:28.0060087Z test accessview::tests::node_roster_lists_node_scope_entities_and_mode_exceptions ... ok
2026-07-31T04:42:28.0060472Z test accessview::tests::target_roster_groups_types_and_counts_rules ... ok
2026-07-31T04:42:28.0063392Z test api::auth::tests::mints_distinct_nonempty_tokens ... ok
2026-07-31T04:42:28.0063770Z test api::auth::tests::missing_endpoint_is_no_endpoint ... ok
2026-07-31T04:42:30.2834817Z test api::auth::tests::dead_owner_repin_refused_when_sid_owns_another_perch ... ok
2026-07-31T04:42:30.3374024Z test api::auth::tests::dead_owner_repin_still_rescues_a_non_custody_sid ... ok
2026-07-31T04:42:30.3685082Z test api::auth::tests::live_owner_mismatch_still_refuses ... ok
2026-07-31T04:42:30.4344862Z test api::auth::tests::dead_owner_repin_refused_when_sid_is_a_psyche_custody_sid ... ok
2026-07-31T04:42:30.4353780Z test api::delivery::tests::inject_all_pty_falls_back_to_hook ... ok
2026-07-31T04:42:30.4356258Z test api::delivery::tests::inject_resolution_drops_pty_defaults_hook ... ok
2026-07-31T04:42:30.4450515Z test api::auth::tests::no_proof_is_refused ... ok
2026-07-31T04:42:30.4786648Z test api::auth::tests::pinned_to_dead_sid_mismatched_poll_repins ... ok
2026-07-31T04:42:30.4926422Z test api::auth::tests::session_id_proof_authenticates ... ok
2026-07-31T04:42:30.5074297Z test api::auth::tests::token_proof_authenticates ... ok
2026-07-31T04:42:30.5075198Z test api::auth::tests::worker_missing_is_no_endpoint ... ok
2026-07-31T04:42:30.5404713Z test api::auth::tests::worker_parent_current_sid_authenticates_after_rotation ... ok
2026-07-31T04:42:30.5566182Z test api::auth::tests::token_auth_path_unchanged ... ok
2026-07-31T04:42:30.5567617Z test api::engineroom::tests::a_refresh_adopts_only_a_real_divergence ... ok
2026-07-31T04:42:30.5572156Z test api::engineroom::tests::an_admin_code_verifies_across_the_ceremony_window_only ... ok
2026-07-31T04:42:30.5573231Z test api::engineroom::tests::subnet_authority_is_the_empowerment_not_the_gate ... ok
2026-07-31T04:42:30.5574420Z test api::engineroom::tests::the_gate_admits_only_the_reserved_id_provisioned_and_authenticated ... ok
2026-07-31T04:42:30.5575994Z test api::engineroom::tests::the_written_node_mode_is_the_one_the_chain_reads ... ok
2026-07-31T04:42:30.5812432Z test api::auth::tests::worker_stored_sid_authenticates ... ok
2026-07-31T04:42:30.6025013Z test api::auth::tests::worker_wrong_sid_and_token_only_refused ... ok
2026-07-31T04:42:30.6173417Z test api::auth::tests::wrong_token_and_wrong_session_refused ... ok
2026-07-31T04:42:30.6640472Z test api::delivery::tests::an_undated_state_is_dated_by_a_non_edge_report ... ok
2026-07-31T04:42:30.6729086Z test api::delivery::tests::echo_gate_explicit_toggle ... ok
2026-07-31T04:42:30.6947217Z test api::delivery::tests::idle_busy_transitions_manage_sentinels ... ok
2026-07-31T04:42:30.8891363Z test api::delivery::tests::idle_drain_peek_returns_non_deferred_rows_only ... ok
2026-07-31T04:42:30.8895804Z test api::reporting::tests::capability_lists_hostable_types ... ok
2026-07-31T04:42:30.9071735Z test api::delivery::tests::idle_no_gate_does_not_arm_gate ... ok
2026-07-31T04:42:30.9963595Z test api::delivery::tests::only_a_real_state_edge_stamps_the_transition_instant ... ok
2026-07-31T04:42:31.1887723Z test api::delivery::tests::poll_drain_holds_deferred_while_resting_and_releases_once_on_wake ... ok
2026-07-31T04:42:31.1889990Z test api::reporting::tests::endpoint_info_attached_node_from_honest_stamps ... ok
2026-07-31T04:42:31.1891301Z test api::reporting::tests::endpoint_info_attached_node_self_attributes_own_node_driver ... ok
2026-07-31T04:42:31.1894263Z test api::reporting::tests::endpoint_info_json_always_carries_an_activity_word ... ok
2026-07-31T04:42:31.4323755Z test api::delivery::tests::poll_drain_suppresses_idle_only_which_reaches_the_relay ... ok
2026-07-31T04:42:31.4328344Z test api::reporting::tests::env_aliases_resolved_from_manifest ... ok
2026-07-31T04:42:31.6233150Z test api::delivery::tests::poll_drain_validates_notify_copies_against_their_rows ... ok
2026-07-31T04:42:31.6236377Z test api::reporting::tests::filedrops_are_fixed_named_files ... ok
2026-07-31T04:42:31.8592207Z test api::delivery::tests::poll_drains_non_deferred_by_default ... ok
2026-07-31T04:42:31.9851203Z test api::delivery::tests::poll_only_drains_when_hook_method_present ... ok
2026-07-31T04:42:32.1312460Z test api::engineroom::tests::a_non_engine_room_attempt_never_touches_the_empower_ledger ... ok
2026-07-31T04:42:32.8095182Z test api::reporting::tests::boundary_appends_to_the_session_ledger ... ok
2026-07-31T04:42:33.0270568Z test api::reporting::tests::boundary_missing_perch_refused ... ok
2026-07-31T04:42:33.0365854Z test api::reporting::tests::boundary_injects_deferred_shell_context ... ok
2026-07-31T04:42:33.1401540Z test api::reporting::tests::boundary_rebinds_keeping_anchor ... ok
2026-07-31T04:42:33.1615380Z test api::reporting::tests::boundary_refuses_rotating_onto_a_psyche_custody_sid ... ok
2026-07-31T04:42:33.3638895Z test api::reporting::tests::boundary_resurfaces_undismissed_notifs ... ok
2026-07-31T04:42:33.3761867Z test api::startup::tests::a_dead_binder_pid_proves_nothing_and_never_drops_the_stamp ... ok
2026-07-31T04:42:33.3763096Z test api::startup::tests::a_dead_relays_capability_stamp_is_not_resurrected_by_a_listener_rebind ... ok
2026-07-31T04:42:33.4779391Z test api::reporting::tests::boundary_with_a_fresh_sid_is_unaffected_by_the_squat_guard ... ok
2026-07-31T04:42:33.4803905Z test api::reporting::tests::digest_entry_validates_and_appends_to_digest_log ... ok
2026-07-31T04:42:33.5018227Z test api::reporting::tests::driven_by_reads_daemon_marker ... ok
2026-07-31T04:42:33.5355840Z test api::reporting::tests::endpoint_info_activity_word_tracks_the_idle_sentinel ... ok
2026-07-31T04:42:33.5581190Z test api::reporting::tests::endpoint_info_reports_and_refuses ... ok
2026-07-31T04:42:33.6211835Z test api::reporting::tests::erase_unregisters_regardless_of_liveness ... ok
2026-07-31T04:42:33.6376833Z test api::reporting::tests::hint_once_per_session_one_per_message ... ok
2026-07-31T04:42:33.6595875Z test api::reporting::tests::history_log_appends ... ok
2026-07-31T04:42:33.6656077Z test api::reporting::tests::presence_records_endpoint ... ok
2026-07-31T04:42:33.7941592Z test api::reporting::tests::session_end_erase_reaps_stale_worker_then_proceeds ... ok
2026-07-31T04:42:33.8863921Z test api::reporting::tests::session_end_erase_refused_with_live_children ... ok
2026-07-31T04:42:33.9282378Z test api::reporting::tests::session_end_erase_wipes_childless_perch ... ok
2026-07-31T04:42:33.9283583Z test api::startup::tests::fresh_bind_over_dead_life_needs_both_terminal_and_a_new_session ... ok
2026-07-31T04:42:33.9716111Z test api::reporting::tests::session_end_soft_preserves_state ... ok
2026-07-31T04:42:34.0342056Z test api::reporting::tests::soft_end_preserves_a_live_listeners_address ... ok
2026-07-31T04:42:34.0343235Z test api::startup::tests::listen_never_asserts_hosting_topology_and_bind_still_does ... ok
2026-07-31T04:42:34.0344436Z test api::startup::tests::listen_online_gate_refuses_capability_only_online ... ok
2026-07-31T04:42:34.0346034Z test api::startup::tests::listen_orphan_exit_line_names_self_and_parent ... ok
2026-07-31T04:42:34.1013543Z test api::reporting::tests::soft_end_still_cleans_a_dead_listeners_address ... ok
2026-07-31T04:42:34.3432156Z test api::startup::tests::a_listener_over_a_dead_pty_is_not_offlined_by_the_liveness_reconcile ... ok
2026-07-31T04:42:34.4276802Z test api::startup::tests::bind_assigns_home_and_revive_preserves_it ... ok
2026-07-31T04:42:34.5252957Z test api::startup::tests::bind_gateway_earns_no_online_stamp ... ok
2026-07-31T04:42:34.6126318Z test api::startup::tests::parent_watchdog_triggers_exit_on_a_dead_parent_only ... ok
2026-07-31T04:42:35.0232641Z test api::startup::tests::bind_listen_control_detach_keeps_the_earned_hosting_authority ... ok
2026-07-31T04:42:35.0234472Z test api::startup::tests::read_env_measured_capture_replaces_prior_stamp ... ok
2026-07-31T04:42:35.1094037Z test api::startup::tests::bind_live_agent_over_prior_ready_agent_earns_online_on_controllable_with_preserved_type ... ok
2026-07-31T04:42:35.2380233Z test api::startup::tests::bind_records_cwd_so_picker_can_group_by_project ... ok
2026-07-31T04:42:35.2495221Z test api::startup::tests::bind_refuses_a_session_id_that_squats_a_psyche_custody_sid ... ok
2026-07-31T04:42:35.3475728Z test api::startup::tests::bind_with_type_establishes_a_gateway_endpoint ... ok
2026-07-31T04:42:35.3476711Z test api::startup::tests::seed_fail_eof_gives_actionable_stale_broker_hint ... ok
2026-07-31T04:42:35.3478226Z test api::startup::tests::seed_restorable_spends_dead_seeds_restores_recoverable ... ok
2026-07-31T04:42:35.3668968Z test api::startup::tests::bind_with_unrelated_sid_is_unaffected_by_the_squat_guard ... ok
2026-07-31T04:42:35.3705434Z test api::startup::tests::empty_session_seed_refusal_spends_the_seed_no_restore ... ok
2026-07-31T04:42:35.3767073Z test api::startup::tests::empty_session_seed_refused ... ok
2026-07-31T04:42:35.4993054Z test api::startup::tests::establish_stamps_controllable_by_hosting_mode ... ok
2026-07-31T04:42:35.6251531Z test api::startup::tests::fresh_create_over_a_stopped_life_reads_active_with_no_wake ... ok
2026-07-31T04:42:35.7042709Z test api::startup::tests::fresh_create_with_no_prior_carries_no_rest_state ... ok
2026-07-31T04:42:35.7043885Z test api::startup::tests::the_pid_role_is_stamped_from_the_entry_path ... ok
2026-07-31T04:42:35.7256057Z test api::startup::tests::live_perch_under_other_session_conflicts ... ok
2026-07-31T04:42:35.7279314Z test api::tests::adapter_is_optional ... ok
2026-07-31T04:42:35.7300254Z test api::startup::tests::missing_seed_refused ... ok
2026-07-31T04:42:35.7582544Z test api::startup::tests::no_seed_is_the_fallback_trigger_then_sid_binds ... ok
2026-07-31T04:42:35.8565808Z test api::startup::tests::post_spawn_bind_establishes_perch ... ok
2026-07-31T04:42:35.8809475Z test api::startup::tests::prebind_refusal_restores_the_seed_for_retry ... ok
2026-07-31T04:42:35.8820673Z test api::tests::state_value_is_validated ... ok
2026-07-31T04:42:35.8904552Z test api::tests::surface_parses ... ok
2026-07-31T04:42:35.9717676Z test api::startup::tests::rebind_same_session_ok ... ok
2026-07-31T04:42:36.0732495Z test api::startup::tests::revive_preserves_prior_rest_state_and_dormant_anchor ... ok
2026-07-31T04:42:36.1669973Z test api::startup::tests::revive_without_cwd_preserves_prior_cwd ... ok
2026-07-31T04:42:36.1884073Z test api::startup::tests::seed_bind_records_seed_captured_cwd ... ok
2026-07-31T04:42:36.2035251Z test api::startup::tests::session_id_fallback_binds_live_perch_from_sid ... ok
2026-07-31T04:42:36.2212381Z test api::startup::tests::session_id_fallback_refuses_empty_sid_and_dead_anchor ... ok
2026-07-31T04:42:36.2217505Z test api::startup::tests::session_id_fallback_refuses_a_psyche_custody_sid ... ok
2026-07-31T04:42:36.2226821Z test cli::resume_resolution_tests::resume_never_feeds_a_provisional ... ok
2026-07-31T04:42:36.2228387Z test cli::run_home_tests::order_by_mru_orders_guidance ... ok
2026-07-31T04:42:36.2230144Z test cli::run_home_tests::run_home_resolution_matrix ... ok
2026-07-31T04:42:36.2231815Z test cli::run_on_live_tests::run_on_live_never_duplicates_and_create_conflicts ... ok
2026-07-31T04:42:36.2233438Z test cli::run_target_tests::resolve_run_target_quadrants ... ok
2026-07-31T04:42:36.2285968Z test api::startup::tests::stale_seed_refusal_spends_the_seed_no_restore ... ok
2026-07-31T04:42:36.2288243Z test cli::tests::a_status_row_reads_held_over_running_and_carries_its_evidence ... ok
2026-07-31T04:42:36.2351151Z test api::startup::tests::stale_seed_with_dead_anchor_refused ... ok
2026-07-31T04:42:36.2400697Z test cli::tests::adapter_add_transport_flags_parse ... ok
2026-07-31T04:42:36.2404206Z test cli::tests::access_subcommands_parse ... ok
2026-07-31T04:42:36.2630225Z test api::startup::tests::successful_bind_consumes_the_seed_exactly_once ... ok
2026-07-31T04:42:36.2746839Z test cli::tests::a_local_hit_never_asks_the_broker ... ok
2026-07-31T04:42:36.2852445Z test api::startup::tests::valid_seed_binds_live_perch ... ok
2026-07-31T04:42:36.2854120Z test cli::tests::adapter_name_validation_flags_every_unknown ... ok
2026-07-31T04:42:36.2856106Z test cli::tests::adapter_names_comma_list_parses_and_refuses_empties ... ok
2026-07-31T04:42:36.2909321Z test api::tests::ctx_manifest_override_wins_when_manifest_present ... ok
2026-07-31T04:42:36.3008847Z test api::tests::ctx_manifest_unregistered_no_manifest_is_none_not_fatal ... ok
2026-07-31T04:42:36.3017155Z test api::tests::ctx_manifest_resolves_from_registry_when_manifest_absent ... ok
2026-07-31T04:42:36.3041735Z test api::tests::load_manifest_resolves_composite_adapter_option ... ok
2026-07-31T04:42:36.3078514Z test cli::tests::adapter_translate_proof_parses ... ok
2026-07-31T04:42:36.3080383Z test cli::tests::adapter_update_install_dir_is_registered_source_dir_not_repo_name ... ok
2026-07-31T04:42:36.3085263Z test cli::tests::adapter_update_notice_absent_when_no_message ... ok
2026-07-31T04:42:36.3089994Z test cli::tests::adapter_update_notice_renders_declared_message_markdown ... ok
2026-07-31T04:42:36.3090785Z test cli::tests::adapter_update_summary_and_exit_aggregate_isolated_failures ... ok
2026-07-31T04:42:36.3138411Z test cli::tests::adapter_subcommands_parse ... ok
2026-07-31T04:42:36.3155110Z test cli::tests::adapter_version_parses ... ok
2026-07-31T04:42:36.3435133Z test api::worker::tests::cascade_guard_tracks_live_children ... ok
2026-07-31T04:42:36.3436915Z test cli::tests::all_hidden_this_node_suppresses_no_perches_marker ... ok
2026-07-31T04:42:36.3438448Z test cli::tests::already_applied_message_reads_up_to_date_no_restart ... ok
2026-07-31T04:42:36.4130119Z test api::worker::tests::guard_clears_only_when_all_children_stopped ... ok
2026-07-31T04:42:36.4131374Z test cli::tests::any_single_evidence_source_is_enough_and_only_nothing_refuses ... ok
2026-07-31T04:42:36.4161076Z test cli::tests::api_adapter_flag_is_group_level_not_post_subcommand ... ok
2026-07-31T04:42:36.4194199Z test cli::tests::api_listen_accepts_session_id_flag ... ok
2026-07-31T04:42:36.4198168Z test cli::tests::applied_message_appends_restart_required_notice ... ok
2026-07-31T04:42:36.4201206Z test cli::tests::applied_message_renders_semver_or_counter_fallback_and_states_applied ... ok
2026-07-31T04:42:36.6038907Z test api::worker::tests::worker_poll_drains_spool ... ok
2026-07-31T04:42:36.7179414Z test cli::tests::apply_release_crc_swap_only_swaps_changed ... ok
2026-07-31T04:42:36.7207783Z test cli::tests::bare_spt_parses_to_none ... ok
2026-07-31T04:42:36.7209008Z test cli::tests::bare_tty_guard ... ok
2026-07-31T04:42:36.7275214Z test cli::tests::bare_update_parses_composite_flags ... ok
2026-07-31T04:42:36.7275989Z test cli::tests::broker_image_line_reports_without_warning_or_remedy ... ok
2026-07-31T04:42:36.7277574Z test cli::tests::classify_fetch_reject_matrix ... ok
2026-07-31T04:42:36.7279138Z test cli::tests::classify_flat_archive_never_misfires ... ok
2026-07-31T04:42:36.7280884Z test cli::tests::classify_multiplatform_captures_only_known_triples ... ok
2026-07-31T04:42:36.7282487Z test cli::tests::cli_send_stamps_cli_at_node_origin ... ok
2026-07-31T04:42:36.7284717Z test cli::tests::composite_plans_core_first_and_core_only_skips_adapters ... ok
2026-07-31T04:42:36.7287567Z test cli::tests::connection_lines_net_less_hides_stale_heartbeat ... ok
2026-07-31T04:42:36.7289299Z test cli::tests::coordinator_image_line_is_the_only_stale_warning ... ok
2026-07-31T04:42:36.7297546Z test cli::tests::create_existing_name_is_usage_error ... ok
2026-07-31T04:42:36.7306319Z test cli::tests::create_mints_two_distinct_keys_and_records_the_mode ... ok
2026-07-31T04:42:36.7308762Z test cli::tests::create_mode_is_never_preselected ... ok
2026-07-31T04:42:36.7314860Z test cli::tests::create_new_existing_name_is_usage_error ... ok
2026-07-31T04:42:36.7435815Z test cli::tests::create_new_mints_shows_and_requests_save ... ok
2026-07-31T04:42:36.7441159Z test cli::tests::create_not_elevated_refuses_without_saving ... ok
2026-07-31T04:42:36.7612012Z test cli::tests::create_prints_joining_material_when_elevated ... ok
2026-07-31T04:42:36.7963225Z test api::worker::tests::worker_poll_holds_deferred_while_resting ... ok
2026-07-31T04:42:36.7965159Z test cli::tests::cross_node_after_filters_a_sealed_turn_exactly_like_the_local_path ... ok
2026-07-31T04:42:36.7966750Z test cli::tests::daemon_offline_hint_only_when_down ... ok
2026-07-31T04:42:36.7981211Z test cli::tests::daemon_refresh_verb_parses ... ok
2026-07-31T04:42:36.8030538Z test cli::tests::create_provisions_the_admin_key_and_show_code_never_does ... ok
2026-07-31T04:42:36.8032461Z test cli::tests::daemonless_apply_message_points_at_finish_or_start ... ok
2026-07-31T04:42:36.8033827Z test cli::tests::deferred_elevation_gate_matrix ... ok
2026-07-31T04:42:36.8053659Z test cli::tests::digest_cursor_flags_parse ... ok
2026-07-31T04:42:36.8073820Z test cli::tests::digest_flag_defaults ... ok
2026-07-31T04:42:36.8075771Z test cli::tests::digest_human_path_keeps_the_stderr_trailer ... ok
2026-07-31T04:42:36.8078148Z test cli::tests::daemon_subcommands_parse ... ok
2026-07-31T04:42:36.8079094Z test cli::tests::digest_json_carries_version_and_leaves_stderr_clean ... ok
2026-07-31T04:42:36.8080521Z test cli::tests::digest_json_predates_path_still_carries_version ... ok
2026-07-31T04:42:36.8080958Z test cli::tests::empty_store_no_flag_guides_to_pair_or_create ... ok
2026-07-31T04:42:36.8111459Z test cli::tests::endpoint_role_parses ... ok
2026-07-31T04:42:36.8113238Z test cli::tests::endpoint_row_json_endpoint_type_is_additive ... ok
2026-07-31T04:42:36.8599068Z test api::worker::tests::worker_start_mints_id_stores_parent_sid_and_metadata ... ok
2026-07-31T04:42:36.8718373Z test cli::tests::endpoint_subcommands_parse ... ok
2026-07-31T04:42:36.8719695Z test cli::tests::engine_room_ceremony_decision_table ... ok
2026-07-31T04:42:36.8721045Z test cli::tests::engine_room_purge_resets_under_elevation_and_refuses_without_it ... ok
2026-07-31T04:42:36.8722351Z test cli::tests::escalation_choice_parses_fail_closed ... ok
2026-07-31T04:42:36.8820364Z test cli::tests::every_read_status_command_emits_valid_json ... ok
2026-07-31T04:42:36.9006247Z test api::worker::tests::worker_start_nests_under_parent ... ok
2026-07-31T04:42:36.9424836Z test api::worker::tests::worker_start_registration_sid_falls_back_to_presented ... ok
2026-07-31T04:42:37.0061624Z test cli::tests::extract_legacy_flat_stays_flat ... ok
2026-07-31T04:42:37.0065730Z test cli::tests::fetch_reject_action_apply_decision ... ok
2026-07-31T04:42:37.0067365Z test cli::tests::filter_after_excludes_at_or_below_cursor ... ok
2026-07-31T04:42:37.0074618Z test cli::tests::filter_after_predates_window_returns_full ... ok
2026-07-31T04:42:37.0075113Z test cli::tests::finish_message_states_fully_live_no_manual_restart ... ok
2026-07-31T04:42:37.0203335Z test cli::tests::extract_multiplatform_missing_my_triple_is_typed_rejection ... ok
2026-07-31T04:42:37.0204797Z test cli::tests::gh_download_command_no_tag_omits_tag ... ok
2026-07-31T04:42:37.0205868Z test cli::tests::gh_download_command_with_tag_shape ... ok
2026-07-31T04:42:37.0208415Z test cli::tests::gh_failure_classes_render_os_correct_hints ... ok
2026-07-31T04:42:37.0210397Z test cli::tests::gh_release_version_compare_decision ... ok
2026-07-31T04:42:37.0211791Z test cli::tests::gh_version_command_shape ... ok
2026-07-31T04:42:37.0258013Z test cli::tests::grant_subcommands_parse ... ok
2026-07-31T04:42:37.0285007Z test cli::tests::extract_multiplatform_places_shared_root_and_flattens_my_triple ... ok
2026-07-31T04:42:37.0301319Z test cli::tests::help_groups_cover_every_command ... ok
2026-07-31T04:42:37.0347504Z test cli::tests::how_to_topics_cover_ready_and_send ... ok
2026-07-31T04:42:37.0425202Z test cli::tests::hot_path_flat_and_moved_verbs_gone ... ok
2026-07-31T04:42:37.0426696Z test cli::tests::install_platform_check_gates_stamp_and_host_arch ... ok
2026-07-31T04:42:37.0429141Z test cli::tests::instance_rows_palette_and_align ... ok
2026-07-31T04:42:37.0432206Z test cli::tests::instance_rows_project_column ... ok
2026-07-31T04:42:37.0439217Z test cli::tests::install_place_is_idempotent_and_path_block_detected ... ok
2026-07-31T04:42:37.0440613Z test cli::tests::join_gate_refuses_without_confirmed_elevation ... ok
2026-07-31T04:42:37.0442821Z test cli::tests::json_activity_key_is_local_only_and_skips_when_unknown ... ok
2026-07-31T04:42:37.0454618Z test cli::tests::json_activity_words_come_from_the_shared_vocabulary_source ... ok
2026-07-31T04:42:37.0457679Z test cli::tests::invalid_usage_errors ... ok
2026-07-31T04:42:37.0459158Z test cli::tests::json_project_field_skip_if_none ... ok
2026-07-31T04:42:37.0571985Z test cli::tests::multi_subnet_refuses_without_flag_then_resolves_with_it ... ok
2026-07-31T04:42:37.0573959Z test cli::tests::node_group_discards_self_and_skips_empty ... ok
2026-07-31T04:42:37.0575726Z test cli::tests::node_group_freshest_epoch_wins_and_unions_subnets ... ok
2026-07-31T04:42:37.0577410Z test cli::tests::node_group_same_id_two_nodes_two_groups ... ok
2026-07-31T04:42:37.0579438Z test cli::tests::node_grouped_render_structure_and_palette ... ok
2026-07-31T04:42:37.0581835Z test cli::tests::node_level_label_names_an_endpointless_peer ... ok
2026-07-31T04:42:37.0583924Z test cli::tests::node_rows_disambiguate_only_on_label_collision ... ok
2026-07-31T04:42:37.0585616Z test cli::tests::node_status_rows_denominator_counts_routable_only ... ok
2026-07-31T04:42:37.0587620Z test cli::tests::node_status_rows_settle_cheap_signals_probe_only_stale ... ok
2026-07-31T04:42:37.0591172Z test cli::tests::not_elevated_refuses_without_leaking_code_or_saving ... ok
2026-07-31T04:42:37.0596727Z test cli::tests::notify_subnet_resolution_home_default ... ok
2026-07-31T04:42:37.0646411Z test cli::tests::notify_surface_parses ... ok
2026-07-31T04:42:37.0647806Z test cli::tests::origin_asset_urls_latest_and_tag ... ok
2026-07-31T04:42:37.3915336Z test cli::tests::adapter_digest_proof_fills_session_id_key ... ok
2026-07-31T04:42:37.3934919Z test cli::tests::pair_namespace_is_gone ... ok
2026-07-31T04:42:37.3937530Z test cli::tests::peer_health_line_names_the_stage_and_stays_silent_when_idle ... ok
2026-07-31T04:42:37.3938724Z test cli::tests::poll_until_ready_fastpath_timeout_and_later_success ... ok
2026-07-31T04:42:37.3940132Z test cli::tests::post_step_notice_arbitration ... ok
2026-07-31T04:42:37.3969058Z test cli::tests::probe_all_cap_batches_into_windows ... ok
2026-07-31T04:42:37.5987816Z test cli::tests::probe_all_runs_concurrently_in_input_order ... ok
2026-07-31T04:42:37.7539595Z test cli::tests::probe_all_timeout_settles_false_without_stalling_batch ... ok
2026-07-31T04:42:37.7541497Z test cli::tests::project_index_line_states_health_not_presence ... ok
2026-07-31T04:42:37.7543220Z test cli::tests::prune_candidates_resolve_never_guess ... ok
2026-07-31T04:42:37.8745615Z test cli::tests::adapter_digest_proof_gates_on_drops ... ok
2026-07-31T04:42:37.9045901Z test cli::tests::adapter_has_live_endpoint_detects_matching_live_perch ... ok
2026-07-31T04:42:37.9627242Z test cli::tests::adapter_has_live_endpoint_false_for_other_or_dead ... ok
2026-07-31T04:42:37.9789905Z test cli::tests::registered_github_home_detects_active_collision ... ok
2026-07-31T04:42:37.9927470Z test cli::tests::adapter_profile_verbs_local_only ... ok
2026-07-31T04:42:37.9929372Z test cli::tests::remote_cell_project_ref_from_gossiped_recent_projects ... ok
2026-07-31T04:42:38.0202114Z test cli::tests::adapter_string_verbs ... ok
2026-07-31T04:42:38.0203138Z test cli::tests::resolve_transport_auto_follows_probe ... ok
2026-07-31T04:42:38.0204403Z test cli::tests::resolve_transport_explicit_never_probes ... ok
2026-07-31T04:42:38.0206072Z test cli::tests::rest_filter_hides_suspended_shows_all_and_corrupt_always ... ok
2026-07-31T04:42:38.0207664Z test cli::tests::rest_filter_status_first_ordering ... ok
2026-07-31T04:42:38.0209248Z test cli::tests::rest_filter_total_disclosure_and_corrupt_annotation ... ok
2026-07-31T04:42:38.0210614Z test cli::tests::restart_plans_lethal_leg_last ... ok
2026-07-31T04:42:38.0223685Z test cli::tests::ring_timeout_defaults ... ok
2026-07-31T04:42:38.0764261Z test cli::tests::run_bounded_yields_value_or_timeout_default ... ok
2026-07-31T04:42:38.0765611Z test cli::tests::self_pin_annotates_psyche_host_failure ... ok
2026-07-31T04:42:38.0767146Z test cli::tests::self_pin_annotates_translation_fault ... ok
2026-07-31T04:42:38.0769100Z test cli::tests::self_pin_includes_description_when_present ... ok
2026-07-31T04:42:38.0796204Z test cli::tests::send_reply_to_flag_is_removed_and_target_required ... ok
2026-07-31T04:42:38.0815112Z test cli::tests::send_user_msg_flag_parses ... ok
2026-07-31T04:42:40.0571882Z test cli::tests::release_archive_extracts_to_a_registrable_root ... ok
2026-07-31T04:42:46.7334238Z test cli::tests::adapter_use_sets_and_clears_pointer ... ok
2026-07-31T04:42:46.7755168Z test cli::tests::adapter_translate_proof_gates_on_commit ... ok
2026-07-31T04:42:46.8030751Z test cli::tests::adapter_version_surfaces_declared_adapter_version ... ok
2026-07-31T04:42:50.0961589Z test cli::tests::an_engine_room_reset_wipes_records_but_never_deletes_the_engine_room ... ok
2026-07-31T04:42:50.1242351Z test cli::tests::apply_user_msg_gate_local_origination ... ok
2026-07-31T04:42:50.2105050Z test cli::tests::shell_spawn_profiled_option_resolves_and_shares_cap ... ok
2026-07-31T04:42:50.2321707Z test cli::tests::shell_subcommands_parse ... ok
2026-07-31T04:42:50.2420797Z test cli::tests::show_code_prints_reprovisioning_material ... ok
2026-07-31T04:42:50.3811633Z test cli::tests::endpoint_stop_marks_offline ... ok
2026-07-31T04:43:04.7800292Z test cli::tests::json_payload_rides_as_attr_alongside_body ... ok
2026-07-31T04:43:05.8699009Z test cli::tests::fork_forks_homes_and_deletes_exactly_the_source ... ok
2026-07-31T04:43:05.8904685Z test cli::tests::single_subnet_auto_selects_and_code_matches_seed ... ok
2026-07-31T04:43:25.0791898Z test cli::tests::owner_shutdown_gated_by_can_shutdown_grant ... ok
2026-07-31T04:43:27.2007196Z test cli::tests::stage_then_swap_failed_fetch_preserves_install ... ok
2026-07-31T04:43:27.3081642Z test cli::tests::staged_floor_admits_when_core_meets_floor ... ok
2026-07-31T04:43:27.5501802Z test cli::tests::staged_floor_refuses_above_floor_and_leaves_dest_untouched ... ok
2026-07-31T04:43:27.5502783Z test cli::tests::stall_evict_line_surfaces_only_a_real_tally ... ok
2026-07-31T04:43:27.5504538Z test cli::tests::stop_guard_refuses_live_sessions_without_force ... ok
2026-07-31T04:43:27.5613700Z test cli::tests::subcommands_parse ... ok
2026-07-31T04:43:27.5769478Z test cli::tests::subnet_arg_shapes_parse ... ok
2026-07-31T04:43:27.5771159Z test cli::tests::subnet_mode_lines_state_declared_captured_and_pending ... ok
2026-07-31T04:43:27.5776898Z test cli::tests::subnet_status_renders_rows_and_hints_never_secrets ... ok
2026-07-31T04:43:27.5778328Z test cli::tests::subnets_joined_banner_renders_rows_and_divider ... ok
2026-07-31T04:43:27.5779728Z test cli::tests::subprocess_detail_prefers_stderr_then_stdout ... ok
2026-07-31T04:43:27.6433984Z test cli::tests::purge_force_asks_before_it_tears_anything_down ... ok
2026-07-31T04:43:27.6435775Z test cli::tests::this_node_group_merges_roster_with_unbound_truth ... ok
2026-07-31T04:43:27.6437294Z test cli::tests::trust_mutation_gate_refuses_without_confirmed_elevation ... ok
2026-07-31T04:43:27.6440933Z test cli::tests::unknown_elevation_falls_back ... ok
2026-07-31T04:43:27.6445192Z test cli::tests::unknown_named_subnet_is_usage_error ... ok
2026-07-31T04:43:27.6466516Z test cli::tests::update_adapters_verb_parses_with_optional_names ... ok
2026-07-31T04:43:27.6488769Z test cli::tests::update_fetch_apply_flag_parses ... ok
2026-07-31T04:43:27.6505447Z test cli::tests::whoami_parses_as_the_identity_verb ... ok
2026-07-31T04:43:27.6507208Z test elevation::tests::already_elevated_short_circuits_on_every_os ... ok
2026-07-31T04:43:27.6508776Z test elevation::tests::current_returns_a_determinate_level_on_supported_platforms ... ok
2026-07-31T04:43:27.6510429Z test elevation::tests::fallback_message_names_authenticator_app_and_subnet ... ok
2026-07-31T04:43:27.6511864Z test elevation::tests::gate_shows_only_when_confirmed_elevated ... ok
2026-07-31T04:43:27.6513612Z test elevation::tests::launcher_argv_is_absolute_exe_plus_verbatim_args ... ok
2026-07-31T04:43:27.6515589Z test elevation::tests::launchers_never_shell_interpolate_a_crafted_arg ... ok
2026-07-31T04:43:27.6517311Z test elevation::tests::print_hint_floor_uses_absolute_path_each_os ... ok
2026-07-31T04:43:27.6518672Z test elevation::tests::unix_path_order_tty_then_pkexec_then_terminal_then_hint ... ok
2026-07-31T04:43:27.6519969Z test elevation::tests::windows_uac_only_interactive_other_always_prints ... ok
2026-07-31T04:43:27.6521653Z test helpfmt::tests::atx_header_at_line_start_strips_and_bolds ... ok
2026-07-31T04:43:27.6522977Z test helpfmt::tests::bold_styles_with_color_and_strips_without ... ok
2026-07-31T04:43:27.6524627Z test helpfmt::tests::code_styles_with_color_and_strips_without ... ok
2026-07-31T04:43:27.6526094Z test helpfmt::tests::color_enabled_truth_table ... ok
2026-07-31T04:43:27.6527653Z test helpfmt::tests::dual_contract_token_survives_strip_mode ... ok
2026-07-31T04:43:27.6529143Z test helpfmt::tests::dual_contract_token_unstyled_while_prose_styles_on_color ... ok
2026-07-31T04:43:27.6530350Z test helpfmt::tests::empty_and_unmatched_markers_stay_literal ... ok
2026-07-31T04:43:27.6531900Z test helpfmt::tests::link_becomes_its_text ... ok
2026-07-31T04:43:27.6533256Z test helpfmt::tests::marker_never_spans_a_hard_break ... ok
2026-07-31T04:43:27.6534513Z test helpfmt::tests::marker_spans_a_clap_soft_wrap ... ok
2026-07-31T04:43:27.6536044Z test helpfmt::tests::multibyte_text_survives ... ok
2026-07-31T04:43:27.6537202Z test helpfmt::tests::nested_code_inside_bold_styles_both ... ok
2026-07-31T04:43:27.6538970Z test helpfmt::tests::plain_text_is_unchanged ... ok
2026-07-31T04:43:27.6540205Z test helpfmt::tests::preexisting_ansi_is_passed_through_untouched ... ok
2026-07-31T04:43:27.6542710Z test helpfmt::tests::resolve_console_color_strips_when_vt_unavailable ... ok
2026-07-31T04:43:27.6543675Z test picker::data::tests::disambiguate_project_ids_cases ... ok
2026-07-31T04:43:27.6545742Z test picker::data::tests::driven_by_display_renders_name_not_hex ... ok
2026-07-31T04:43:27.6555185Z test cli::tests::the_evidence_census_reads_each_local_source ... ok
2026-07-31T04:43:27.6608019Z test cli::tests::purge_offline_gate_and_self_guard ... ok
2026-07-31T04:43:34.1201969Z test cli::tests::resolve_proof_target_override_reads_on_disk ... ok
2026-07-31T04:43:34.1203971Z test picker::data::tests::indexed_projection_full_w2shaped_and_absent_legs ... ok
2026-07-31T04:43:34.1205636Z test picker::data::tests::non_drivable_predicate_covers_worker_and_psyche ... ok
2026-07-31T04:43:34.1280597Z test cli::tests::purge_removes_every_record ... ok
2026-07-31T04:43:34.5996100Z test cli::tests::shell_channels_relay_sensory_and_text_file ... ok
2026-07-31T04:43:34.5999015Z test picker::data::tests::project_refs_from_sessions_excludes_owlery_and_dedups_newest_first ... ok
2026-07-31T04:43:34.6002014Z test picker::data::tests::project_refs_from_unions_fresh_origin_and_store_branches ... ok
2026-07-31T04:43:34.6004118Z test picker::data::tests::reconcile_overrides_subnet_with_local_roster ... ok
2026-07-31T04:43:34.6489324Z test cli::tests::shell_owner_exclusivity_negatives ... ok
2026-07-31T04:43:34.7748745Z test cli::tests::shell_relink_relaunches_offline_instances_only ... ok
2026-07-31T04:43:34.7750534Z test picker::data::tests::resume_rows_derive_per_row_project_and_drop_owlery_sessions ... ok
2026-07-31T04:43:35.0424902Z test cli::tests::shell_spawn_approval_floor_gates ... ok
2026-07-31T04:43:35.0426351Z test picker::data::tests::row_status_drives_unbound_display ... ok
2026-07-31T04:43:35.3056164Z test cli::tests::shell_spawn_cap_and_over_cap_gates ... ok
2026-07-31T04:43:35.3062748Z test picker::model::tests::adapter_tree_nests_profiles ... ok
2026-07-31T04:43:35.3067879Z test picker::model::tests::back_unwinds ... ok
2026-07-31T04:43:35.3071887Z test picker::model::tests::build_project_choices_head_here_rest ... ok
2026-07-31T04:43:35.3073349Z test picker::model::tests::category_labels_render_display_forms ... ok
2026-07-31T04:43:35.3074807Z test picker::model::tests::category_ring_wraps ... ok
2026-07-31T04:43:35.3077005Z test picker::model::tests::change_adapter_picks_and_returns_to_confirm ... ok
2026-07-31T04:43:35.3079148Z test picker::model::tests::choose_project_outcome_bakes_cwd_and_diverts ... ok
2026-07-31T04:43:35.3080728Z test picker::model::tests::confirm_local_offline_unchanged_by_wake_split ... ok
2026-07-31T04:43:35.3082302Z test picker::model::tests::confirm_options_remote_suspended_is_wake_not_start ... ok
2026-07-31T04:43:35.3083958Z test picker::model::tests::confirm_options_status_dependent ... ok
2026-07-31T04:43:35.3086035Z test picker::model::tests::confirm_terminal_routes ... ok
2026-07-31T04:43:35.3087816Z test picker::model::tests::confirm_terminal_wake_carries_raw_node ... ok
2026-07-31T04:43:35.3089533Z test picker::model::tests::create_new_multisubnet_inserts_home_layer ... ok
2026-07-31T04:43:35.3091194Z test picker::model::tests::create_outcome_bakes_run ... ok
2026-07-31T04:43:35.3092436Z test picker::model::tests::cursor_clamps ... ok
2026-07-31T04:43:35.3093820Z test picker::model::tests::display_mapping_matrix ... ok
2026-07-31T04:43:35.3095292Z test picker::model::tests::display_status_four_state_type_gated ... ok
2026-07-31T04:43:35.3096605Z test picker::model::tests::display_status_unbound_is_hollow_and_attachable ... ok
2026-07-31T04:43:35.3098052Z test picker::model::tests::empty_scope_opens_create ... ok
2026-07-31T04:43:35.3099384Z test picker::model::tests::ep_display_glyph_and_square_palette ... ok
2026-07-31T04:43:35.3100677Z test picker::model::tests::esc_backs_out_of_home_layer ... ok
2026-07-31T04:43:35.3103353Z test picker::model::tests::filter_narrows ... ok
2026-07-31T04:43:35.3104996Z test picker::model::tests::from_resource_row_maps_gossiped_adapter_projects_controlled ... ok
2026-07-31T04:43:35.3106567Z test picker::model::tests::home_selection_bakes_into_run_subnet ... ok
2026-07-31T04:43:35.3107433Z test picker::model::tests::kind_routes ... ok
2026-07-31T04:43:35.3109144Z test picker::model::tests::launch_keys_live_only_on_launch_capable_highlights ... ok
2026-07-31T04:43:35.3110271Z test picker::model::tests::prefill_jumps_to_create ... ok
2026-07-31T04:43:35.3111784Z test picker::model::tests::project_filter_keys_on_slug_while_tab_renders_display ... ok
2026-07-31T04:43:35.3113201Z test picker::model::tests::purge_confirm_yields_outcome_and_backs_out ... ok
2026-07-31T04:43:35.3114976Z test picker::model::tests::purge_shortcut_gates_to_offline_local ... ok
2026-07-31T04:43:35.3116878Z test picker::model::tests::reenter_create_keeps_or_clears_id ... ok
2026-07-31T04:43:35.3118307Z test picker::model::tests::remove_endpoint_drops_row_and_clamps_cursor ... ok
2026-07-31T04:43:35.3119674Z test picker::model::tests::resume_outcome_adapter_follows_recorded_row ... ok
2026-07-31T04:43:35.3121475Z test picker::model::tests::resume_outcome_bakes_session ... ok
2026-07-31T04:43:35.3124316Z test picker::model::tests::resume_title_render ... ok
2026-07-31T04:43:35.3125729Z test picker::model::tests::should_offer_project_choice_fire_conditions ... ok
2026-07-31T04:43:35.3126888Z test picker::model::tests::single_subnet_skips_home_layer ... ok
2026-07-31T04:43:35.3127970Z test picker::model::tests::suspended_is_distinct_from_offline ... ok
2026-07-31T04:43:35.3129397Z test picker::model::tests::visible_partitions_and_sorts ... ok
2026-07-31T04:43:35.3131164Z test picker::shortcut::tests::bakes_create_attach_by_default ... ok
2026-07-31T04:43:35.3132738Z test picker::shortcut::tests::bakes_resume_and_action ... ok
2026-07-31T04:43:35.3134129Z test picker::shortcut::tests::basename_is_parameterized ... ok
2026-07-31T04:43:35.3135454Z test picker::shortcut::tests::sentinel_detection ... ok
2026-07-31T04:43:35.3472833Z test picker::shortcut::tests::write_create_update_refuse ... ok
2026-07-31T04:43:35.3474369Z test picker::tests::backspace_backs_out_screens_like_esc ... ok
2026-07-31T04:43:35.3475837Z test picker::tests::backspace_stays_char_delete_in_text_contexts ... ok
2026-07-31T04:43:35.3477126Z test picker::tests::purge_outcomes_convert_to_flash_lines ... ok
2026-07-31T04:43:35.3544608Z test picker::tests::purge_transition_reconstructs_the_complete_screen_after_external_mutation ... ok
2026-07-31T04:43:35.3578347Z test picker::view::tests::adapter_tree_buffer ... ok
2026-07-31T04:43:35.3603120Z test picker::view::tests::change_adapter_screen_renders_tree_and_apply_legend ... ok
2026-07-31T04:43:35.3634893Z test picker::view::tests::choose_project_buffer_keeps_confirm_panel ... ok
2026-07-31T04:43:35.3668318Z test picker::view::tests::confirm_buffer_options ... ok
2026-07-31T04:43:35.3703447Z test picker::view::tests::confirm_fork_and_shortcut_labels_are_dir_relative ... ok
2026-07-31T04:43:35.3748298Z test picker::view::tests::confirm_panel_history_renders_display_not_slug ... ok
2026-07-31T04:43:35.3772129Z test picker::view::tests::create_home_lists_subnets ... ok
2026-07-31T04:43:35.3822267Z test picker::view::tests::footer_hints_h_s_only_when_launch_keys_live ... ok
2026-07-31T04:43:35.3845550Z test picker::view::tests::kind_buffer ... ok
2026-07-31T04:43:35.3878391Z test picker::view::tests::pick_buffer_has_squares_and_description ... ok
2026-07-31T04:43:35.3911889Z test picker::view::tests::pick_empty_category_hint ... ok
2026-07-31T04:43:35.4147002Z test picker::view::tests::pick_status_line_four_state ... ok
2026-07-31T04:43:35.4183733Z test picker::view::tests::resume_buffer_keeps_confirm_panel ... ok
2026-07-31T04:43:35.4213390Z test picker::view::tests::resume_buffer_lists_sessions ... ok
2026-07-31T04:43:36.8187109Z test cli::tests::endpoint_role_overwrite_is_the_sole_writer has been running for over 60 seconds
2026-07-31T04:43:46.4320867Z test cli::tests::shell_spawn_gates_on_the_registered_set ... ok
2026-07-31T04:43:46.4322325Z test rc::tests::attach_gate_routes_on_session_truth_not_the_row ... ok
2026-07-31T04:43:50.2448074Z test cli::tests::shutdown_and_stop_share_the_postcondition_and_differ_only_in_ceremony has been running for over 60 seconds
2026-07-31T04:43:50.3878109Z test cli::tests::shutdown_on_a_broker_hosted_endpoint_stamps_after_the_reap has been running for over 60 seconds
2026-07-31T04:43:55.5539648Z test cli::tests::endpoint_role_overwrite_is_the_sole_writer ... ok
2026-07-31T04:43:55.6587050Z test cli::tests::shutdown_and_stop_share_the_postcondition_and_differ_only_in_ceremony ... ok
2026-07-31T04:43:55.6588390Z test rc::tests::bracketed_paste_framing_is_exact_and_content_verbatim ... ok
2026-07-31T04:43:55.6589770Z test rc::tests::broker_host_child ... ok
2026-07-31T04:43:55.6591445Z test rc::tests::canonical_wire_id_strips_qualifiers_to_the_bare_id ... ok
2026-07-31T04:43:55.6592732Z test rc::tests::classify_read_err_eof_is_graceful_not_fatal ... ok
2026-07-31T04:43:55.6594097Z test rc::tests::clipboard_paste_wraps_nonempty_and_noops_on_empty_or_failure ... ok
2026-07-31T04:43:55.6595290Z test rc::tests::detach_keybind_semantics ... ok
2026-07-31T04:43:55.6596613Z test rc::tests::detach_prefix_spans_chunks ... ok
2026-07-31T04:43:55.6597896Z test rc::tests::display_guard_postlude_exactly_once_and_inactive_silent ... ok
2026-07-31T04:43:55.6599262Z test rc::tests::driver_phrase_names_own_node_plainly_but_remote_verbatim ... ok
2026-07-31T04:43:55.7633173Z test cli::tests::shutdown_on_a_broker_hosted_endpoint_stamps_after_the_reap ... ok
2026-07-31T04:43:55.7634052Z test rc::tests::first_event_stall_decision ... ok
2026-07-31T04:43:55.7635475Z test rc::tests::fold_code_key_prompt_rules ... ok
2026-07-31T04:43:55.7637278Z test rc::tests::give_up_copy_names_daemon_down_vs_generic ... ok
2026-07-31T04:43:55.7638776Z test rc::tests::harness_only_row_matches_online_seatless_live_agents_only ... ok
2026-07-31T04:43:55.7640069Z test rc::tests::identity_line_format ... ok
2026-07-31T04:43:55.7641941Z test rc::tests::key_event_step_detach_sm ... ok
2026-07-31T04:43:55.7643430Z test rc::tests::mouse_is_paste_only_right_button_down ... ok
2026-07-31T04:43:55.7645128Z test rc::tests::mouse_mode_decset_scan_survives_split_across_chunks ... ok
2026-07-31T04:43:55.7646667Z test rc::tests::mouse_mode_decset_scan_tracks_enable_and_sgr ... ok
2026-07-31T04:43:55.7650534Z test rc::tests::op_minter_distinct_and_monotonic ... ok
2026-07-31T04:43:55.7651874Z test rc::tests::pre_broker_busy_guidance_fires_for_any_driver_not_just_remote ... ok
2026-07-31T04:43:55.7653441Z test rc::tests::public_attach_failure_maps_deadline_class_only ... ok
2026-07-31T04:43:55.7655167Z test rc::tests::pump_status_emit_sequence_over_write_sink ... ok
2026-07-31T04:43:55.8051132Z test cli::tests::shutdown_on_a_harness_hosted_endpoint_claims_no_process ... ok
2026-07-31T04:43:55.8052652Z test rc::tests::reassert_scanner_survives_split_across_chunks ... ok
2026-07-31T04:43:55.8054252Z test rc::tests::reassert_scanner_triggers_only_on_region_destroyers ... ok
2026-07-31T04:43:55.8055778Z test rc::tests::reconnect_banner_clears_and_centers ... ok
2026-07-31T04:43:55.8057381Z test rc::tests::reconnect_banner_shows_the_countdown ... ok
2026-07-31T04:43:55.8058806Z test rc::tests::reconnect_class_only_severed_transport_redrives ... ok
2026-07-31T04:43:55.8060118Z test rc::tests::reconnect_remaining_secs_counts_down_ceil ... ok
2026-07-31T04:43:55.8061555Z test rc::tests::reconnect_window_expiry_decision ... ok
2026-07-31T04:43:55.8062883Z test rc::tests::scroll_dir_classifies_wheel_only ... ok
2026-07-31T04:43:55.8064047Z test rc::tests::scroll_sgr_emits_exact_xterm_bytes ... ok
2026-07-31T04:43:55.8065137Z test rc::tests::serve_eof_severed_vs_refused ... ok
2026-07-31T04:43:55.8066465Z test rc::tests::status_assert_reserves_row1_then_repaints ... ok
2026-07-31T04:43:55.8067998Z test rc::tests::status_repaint_exact_bytes_and_right_align ... ok
2026-07-31T04:43:55.8069123Z test rc::tests::status_restore_exact_bytes ... ok
2026-07-31T04:43:55.8070701Z test rc::tests::status_row_marker_is_disabled_by_flag ... ok
2026-07-31T04:43:55.8071824Z test rc::tests::status_update_size_repoints_geometry ... ok
2026-07-31T04:43:55.8073549Z test rc::tests::teardown_matrix_postlude_precedes_prose_across_every_final_class ... ok
2026-07-31T04:43:55.8074804Z test rc::tests::the_client_refuses_engine_room_viewports_and_qualified_targets_only ... ok
2026-07-31T04:43:55.8076247Z test rc::tests::translate_key_event_emits_exact_xterm_vt ... ok
2026-07-31T04:43:55.8077322Z test rc::tests::with_vt_output_disables_newline_auto_return ... ok
2026-07-31T04:43:55.8078568Z test rc::tests::with_vt_output_enables_virtual_terminal_processing ... ok
2026-07-31T04:43:55.9523458Z test cli::tests::spt_hosted_no_relay_detection ... ok
2026-07-31T04:43:56.0256729Z test picker::data::tests::gather_endpoints_projects_from_seeded_index_with_zero_git ... ok
2026-07-31T04:43:56.0917920Z test picker::data::tests::gather_renders_live_unbound ... ok
2026-07-31T04:43:56.4490558Z test picker::data::tests::home_subnet_options_is_mru_ordered ... ok
2026-07-31T04:43:56.4684774Z test picker::data::tests::own_node_tab_label_falls_back_to_keyprefix ... ok
2026-07-31T04:43:56.5391365Z test picker::data::tests::picker_excludes_flat_worker_and_psyche ... ok
2026-07-31T04:43:56.5627474Z test picker::data::tests::remote_picker_renders_suspended_dead_perch_offline ... ok
2026-07-31T04:43:56.5628072Z test roster::tests::match_self_by_ancestry_disambiguates_and_none ... ok
2026-07-31T04:43:56.5798254Z test picker::data::tests::remote_rows_render_full_palette_parity ... ok
2026-07-31T04:43:56.5800818Z test teardown::tests::an_unconfirmed_row_over_a_dead_root_is_stale_not_a_survivor ... ok
2026-07-31T04:43:56.6004163Z test picker::data::tests::resume_rows_title_from_index_cwd_map_with_pure_fallback ... ok
2026-07-31T04:43:56.6005066Z test teardown::tests::timeout_refuses_the_stamp_and_names_the_survivor ... ok
2026-07-31T04:43:56.6012050Z test teardown::tests::topology_gate_is_controllable_true_only ... ok
2026-07-31T04:43:56.6012684Z test tests::broken_pipe_panic_classifier ... ok
2026-07-31T04:43:56.6024630Z test wansend::tests::bare_id_resolves_across_remote_snapshot ... ok
2026-07-31T04:43:56.6059556Z test wansend::tests::classify_wan_reply_only_delivers_on_positive_outcomes ... ok
2026-07-31T04:43:56.6209648Z test teardown::tests::liveness_proof_needs_a_real_snapshot_and_finds_this_process ... ok
2026-07-31T04:43:56.6218500Z test wansend::tests::refusals_render_copy_paste_targets ... ok
2026-07-31T04:43:56.6228944Z test picker::data::tests::shared_machine_is_one_group_with_unioned_subnets ... ok
2026-07-31T04:43:56.6229546Z test wansend::tests::load_snapshots_degrades_on_junk ... ok
2026-07-31T04:43:56.6438532Z test rc::tests::attach_against_stopped_daemon_never_spawns_and_exits_loud ... ok
2026-07-31T04:43:56.7007282Z test rc::tests::attach_offline_endpoint_short_circuits_clean ... ok
2026-07-31T04:43:56.7449272Z 
2026-07-31T04:43:56.7449612Z running 1 test
2026-07-31T04:43:56.7878406Z NTP_TOTP_UNCORRECTED: all NTP servers unreachable — ceremony clock = raw system clock
2026-07-31T04:43:56.8367318Z CONN_LIFECYCLE: conn=1 role=brain wall_ms=1785473036836 mono_ms=0 event=transport-close poisoned=false timed_out=false [REQ-CONN-POISON-ATTRIBUTION]
2026-07-31T04:43:56.8368625Z CONN_LIFECYCLE: conn=3 role=brain wall_ms=1785473036836 mono_ms=0 event=write-start [REQ-CONN-POISON-ATTRIBUTION]
2026-07-31T04:43:56.9005099Z CONN_LIFECYCLE: conn=2 role=brain controller session=1 endpoint=reheal by=local wall_ms=1785473036900 mono_ms=63 event=controller-attach session=1 from_seq=0 [REQ-CONN-POISON-ATTRIBUTION]
2026-07-31T04:43:56.9009491Z CONN_LIFECYCLE: conn=2 role=brain controller session=1 endpoint=reheal by=local wall_ms=1785473036900 mono_ms=64 event=write-start [REQ-CONN-POISON-ATTRIBUTION]
2026-07-31T04:43:56.9018068Z CONN_LIFECYCLE: conn=4 role=brain wall_ms=1785473036901 mono_ms=65 event=write-start [REQ-CONN-POISON-ATTRIBUTION]
2026-07-31T04:43:56.9167829Z CONN_LIFECYCLE: conn=4 role=brain stream-subscriber stream=2 wall_ms=1785473036916 mono_ms=79 event=stream-sub-attach stream=2 from_seq=0 [REQ-CONN-POISON-ATTRIBUTION]
2026-07-31T04:43:56.9379181Z CONN_LIFECYCLE: conn=5 role=brain wall_ms=1785473036937 mono_ms=101 event=write-start [REQ-CONN-POISON-ATTRIBUTION]
2026-07-31T04:43:56.9380181Z CONN_LIFECYCLE: conn=5 role=brain wall_ms=1785473036937 mono_ms=101 event=transport-close poisoned=false timed_out=false [REQ-CONN-POISON-ATTRIBUTION]
2026-07-31T04:43:56.9383684Z CONN_LIFECYCLE: conn=6 role=brain wall_ms=1785473036938 mono_ms=101 event=write-start [REQ-CONN-POISON-ATTRIBUTION]
2026-07-31T04:43:56.9386413Z CONN_LIFECYCLE: conn=6 role=brain stream-subscriber stream=1 wall_ms=1785473036938 mono_ms=101 event=stream-sub-attach stream=1 from_seq=0 [REQ-CONN-POISON-ATTRIBUTION]
2026-07-31T04:43:56.9400408Z CONN_LIFECYCLE: conn=6 role=brain stream-subscriber stream=1 viewer session=1 endpoint=reheal vid=0 wall_ms=1785473036939 mono_ms=103 event=viewer-attach session=1 vid=0 from_seq=0 [REQ-CONN-POISON-ATTRIBUTION]
2026-07-31T04:43:56.9404336Z SUBSCRIBE_DECISION: session=1 endpoint=reheal by=fd1724385aa0c75b64fb78cd602fa1d991fdebf76b13c58ed702eac835e9f618 conn=6 intent=viewer old_by=- old_gen=0 req_gen=0 decision=viewer
2026-07-31T04:43:56.9405952Z CONN_LIFECYCLE: conn=6 role=brain stream-subscriber stream=1 viewer session=1 endpoint=reheal vid=0 viewer session=1 endpoint=reheal vid=1 wall_ms=1785473036940 mono_ms=103 event=viewer-attach session=1 vid=1 from_seq=0 [REQ-CONN-POISON-ATTRIBUTION]
2026-07-31T04:43:56.9408976Z SUBSCRIBE_DECISION: session=1 endpoint=reheal by=fd1724385aa0c75b64fb78cd602fa1d991fdebf76b13c58ed702eac835e9f618 conn=6 intent=viewer old_by=- old_gen=0 req_gen=0 decision=viewer
2026-07-31T04:43:56.9754258Z 
2026-07-31T04:43:56.9754547Z running 1 test
2026-07-31T04:43:57.0238936Z NTP_TOTP_UNCORRECTED: all NTP servers unreachable — ceremony clock = raw system clock
2026-07-31T04:43:57.0684479Z CONN_LIFECYCLE: conn=1 role=brain wall_ms=1785473037068 mono_ms=0 event=transport-close poisoned=false timed_out=false [REQ-CONN-POISON-ATTRIBUTION]
2026-07-31T04:43:57.0685920Z CONN_LIFECYCLE: conn=3 role=brain wall_ms=1785473037068 mono_ms=0 event=write-start [REQ-CONN-POISON-ATTRIBUTION]
2026-07-31T04:43:57.1042892Z CONN_LIFECYCLE: conn=2 role=brain controller session=1 endpoint=reheal by=local wall_ms=1785473037104 mono_ms=35 event=controller-attach session=1 from_seq=0 [REQ-CONN-POISON-ATTRIBUTION]
2026-07-31T04:43:57.1053375Z CONN_LIFECYCLE: conn=2 role=brain controller session=1 endpoint=reheal by=local wall_ms=1785473037104 mono_ms=36 event=write-start [REQ-CONN-POISON-ATTRIBUTION]
2026-07-31T04:43:57.9605453Z CONN_LIFECYCLE: conn=4 role=brain wall_ms=1785473037960 mono_ms=891 event=write-start [REQ-CONN-POISON-ATTRIBUTION]
2026-07-31T04:43:57.9739016Z CONN_LIFECYCLE: conn=4 role=brain stream-subscriber stream=2 wall_ms=1785473037973 mono_ms=905 event=stream-sub-attach stream=2 from_seq=0 [REQ-CONN-POISON-ATTRIBUTION]
2026-07-31T04:43:57.9961477Z CONN_LIFECYCLE: conn=5 role=brain wall_ms=1785473037995 mono_ms=927 event=write-start [REQ-CONN-POISON-ATTRIBUTION]
2026-07-31T04:43:57.9962536Z CONN_LIFECYCLE: conn=5 role=brain wall_ms=1785473037996 mono_ms=927 event=transport-close poisoned=false timed_out=false [REQ-CONN-POISON-ATTRIBUTION]
2026-07-31T04:43:57.9966301Z CONN_LIFECYCLE: conn=6 role=brain wall_ms=1785473037996 mono_ms=928 event=write-start [REQ-CONN-POISON-ATTRIBUTION]
2026-07-31T04:43:57.9969255Z CONN_LIFECYCLE: conn=6 role=brain stream-subscriber stream=1 wall_ms=1785473037996 mono_ms=928 event=stream-sub-attach stream=1 from_seq=0 [REQ-CONN-POISON-ATTRIBUTION]
2026-07-31T04:43:57.9972973Z CONN_LIFECYCLE: conn=6 role=brain stream-subscriber stream=1 viewer session=1 endpoint=reheal vid=0 wall_ms=1785473037997 mono_ms=928 event=viewer-attach session=1 vid=0 from_seq=0 [REQ-CONN-POISON-ATTRIBUTION]
2026-07-31T04:43:57.9976358Z SUBSCRIBE_DECISION: session=1 endpoint=reheal by=fd1724385aa0c75b64fb78cd602fa1d991fdebf76b13c58ed702eac835e9f618 conn=6 intent=viewer old_by=- old_gen=0 req_gen=0 decision=viewer
2026-07-31T04:43:57.9977758Z CONN_LIFECYCLE: conn=6 role=brain stream-subscriber stream=1 viewer session=1 endpoint=reheal vid=0 viewer session=1 endpoint=reheal vid=1 wall_ms=1785473037997 mono_ms=929 event=viewer-attach session=1 vid=1 from_seq=0 [REQ-CONN-POISON-ATTRIBUTION]
2026-07-31T04:43:57.9979787Z SUBSCRIBE_DECISION: session=1 endpoint=reheal by=fd1724385aa0c75b64fb78cd602fa1d991fdebf76b13c58ed702eac835e9f618 conn=6 intent=viewer old_by=- old_gen=0 req_gen=0 decision=viewer
2026-07-31T04:43:58.3221033Z CONN_LIFECYCLE: conn=6 role=brain stream-subscriber stream=1 viewer session=1 endpoint=reheal vid=0 viewer session=1 endpoint=reheal vid=1 wall_ms=1785473038321 mono_ms=1253 event=stream-sub-release stream=1 [REQ-CONN-POISON-ATTRIBUTION]
2026-07-31T04:43:58.3222336Z CONN_LIFECYCLE: conn=7 role=brain wall_ms=1785473038321 mono_ms=1253 event=transport-close poisoned=false timed_out=false [REQ-CONN-POISON-ATTRIBUTION]
2026-07-31T04:43:58.3298535Z test rc::tests::attach_viewport_reconnects_across_a_broker_bounce ... ok
2026-07-31T04:44:00.4694994Z test rc::tests::establish_attach_reuses_the_probes_carried_pump_conn ... ok
2026-07-31T04:44:02.5305190Z test rc::tests::qualified_targets_attach_with_bare_wire_id ... ok
2026-07-31T04:44:02.5392519Z test roster::tests::detect_self_by_ancestry_none_when_no_ancestor_owns_a_perch ... ok
2026-07-31T04:44:02.5618968Z test roster::tests::detect_self_by_ancestry_resolves_a_live_ancestor_perch ... ok
2026-07-31T04:44:02.5803995Z test roster::tests::detect_self_id_endpoint_id_leg_is_label_only_and_perch_gated ... ok
2026-07-31T04:44:02.6114495Z test roster::tests::detect_self_id_resolves_identity_with_zero_git_spawns ... ok
2026-07-31T04:44:02.6227161Z test roster::tests::detect_self_resolves_spt_hosted_perch_via_parent_pid ... ok
2026-07-31T04:44:02.6250990Z test roster::tests::enumerate_yields_offline_corrupt_row_for_unparseable_info ... ok
2026-07-31T04:44:02.6464087Z test roster::tests::list_all_perch_dirs_enumerates_nested_psyche_for_self_resolution ... ok
2026-07-31T04:44:02.6659512Z test roster::tests::parent_pid_candidates_stay_ancestry_gated ... ok
2026-07-31T04:44:03.0813235Z test wansend::tests::remote_rest_suspends_and_wakes_with_the_deferred_gate ... ok
2026-07-31T04:44:03.1537646Z test wansend::tests::resolve_and_dial_owner_dials_the_resolved_node ... ok
2026-07-31T04:44:03.2034693Z test wansend::tests::resolve_and_dial_owner_is_honest_on_resolution_misses ... ok
2026-07-31T04:44:03.2147646Z test wansend::tests::seed_first_addr_prefers_the_cached_direct_address ... ok
2026-07-31T04:44:03.4183330Z test wansend::tests::wan_send_ships_to_the_resolved_node ... ok
2026-07-31T04:44:03.4183599Z 
2026-07-31T04:44:03.4183851Z test result: ok. 475 passed; 0 failed; 0 ignored; 0 measured; 0 filtered out; finished in 95.41s
2026-07-31T04:44:03.4184226Z 
2026-07-31T04:44:03.4440052Z      Running unittests tests\fixtures\translate_proof_fixture.rs (target\debug\deps\translate_proof_fixture-6c1f32e3e25e0c2c.exe)
2026-07-31T04:44:03.5370543Z 
2026-07-31T04:44:03.5370841Z running 0 tests
2026-07-31T04:44:03.5370958Z 
2026-07-31T04:44:03.5372610Z test result: ok. 0 passed; 0 failed; 0 ignored; 0 measured; 0 filtered out; finished in 0.00s
2026-07-31T04:44:03.5372959Z 
2026-07-31T04:44:03.5382318Z      Running unittests src\lib.rs (target\debug\deps\spt_daemon-4d86a85ce347685e.exe)
2026-07-31T04:44:04.3863155Z 
2026-07-31T04:44:04.3863484Z running 723 tests
2026-07-31T04:44:04.3870017Z test access::tests::the_inbound_lock_answers_replies_only_and_only_while_controlled ... ok
2026-07-31T04:44:04.3870634Z test access::tests::the_knock_exemption_hook_refuses_everything_today ... ok
2026-07-31T04:44:04.3871274Z test activity::tests::an_identical_observation_pushes_nothing ... ok
2026-07-31T04:44:04.3871832Z test activity::tests::a_token_change_with_an_identical_state_owes_a_push ... ok
2026-07-31T04:44:04.3872317Z test activity::tests::a_state_change_owes_a_push_both_directions ... ok
2026-07-31T04:44:04.3873007Z test activity::tests::an_unseen_link_owes_a_push ... ok
2026-07-31T04:44:04.3874305Z test activity::tests::remember_forgets_a_vanished_link_so_its_return_re_pushes ... ok
2026-07-31T04:44:04.3875478Z test activity::tests::the_diff_is_per_link_not_per_owner ... ok
2026-07-31T04:44:04.3883047Z test activity::tests::observe_links_on_an_absent_owlery_is_empty ... ok
2026-07-31T04:44:04.3885151Z test adapter_update::tests::delegated_attested_delegates_command ... ok
2026-07-31T04:44:04.3886975Z test adapter_update::tests::delegated_unattested_is_skipped ... ok
2026-07-31T04:44:04.3910642Z test activity::tests::the_flip_marker_is_idempotent_to_drop_and_taken_exactly_once ... ok
2026-07-31T04:44:04.4052683Z test adapter_update::tests::file_pull_verified_against_adapter_key ... ok
2026-07-31T04:44:04.4055467Z test adapter_update::tests::file_pull_tampered_bytes_rejected ... ok
2026-07-31T04:44:04.4055917Z test adapter_update::tests::file_pull_without_payload_is_skipped ... ok
2026-07-31T04:44:04.4057001Z test adapter_update::tests::gh_release_is_managed_cli_side_not_in_pure_plan ... ok
2026-07-31T04:44:04.4144965Z test adapter_update::tests::ripple_conducts_each_adapter_in_order ... ok
2026-07-31T04:44:04.4145453Z test adapter_update::tests::file_pull_wrong_key_rejected ... ok
2026-07-31T04:44:04.8844947Z test access::tests::corrupt_store_degrades_closed_but_replies_survive ... ok
2026-07-31T04:44:04.8893181Z test activity::tests::an_owner_with_no_linked_shell_is_not_observed ... ok
2026-07-31T04:44:04.9202003Z test activity::tests::observe_links_sees_only_online_shells_holding_a_token ... ok
2026-07-31T04:44:04.9202503Z test access::tests::discover_gate_discloses_per_viewer ... ok
2026-07-31T04:44:04.9675162Z test access::tests::gate_feeds_the_proven_sender_endpoint_tier ... ok
2026-07-31T04:44:04.9711532Z test adapter_update::tests::ripple_registered_uses_the_registered_set ... ok
2026-07-31T04:44:04.9717225Z test activity::tests::an_unstamped_owner_observes_undated_and_stays_silent_across_sweeps ... ok
2026-07-31T04:44:04.9764991Z test applyhost::tests::apply_staged_daemonless_swaps_binary_with_no_broker ... ok
2026-07-31T04:44:04.9794899Z test access::tests::reply_passes_where_unsolicited_refused ... ok
2026-07-31T04:44:04.9811847Z test applyhost::tests::brain_restart_verb_raises_the_supervisor_signal ... ok
2026-07-31T04:44:04.9851270Z test applyhost::tests::broker_reports_its_compiled_image_version_over_ipc ... ok
2026-07-31T04:44:04.9854858Z test access::tests::discover_gate_withholds_everything_while_degraded ... ok
2026-07-31T04:44:04.9856503Z test applyhost::tests::staged_already_applied_classifies_up_to_date_vs_newer ... ok
2026-07-31T04:44:04.9860079Z test attach::tests::the_engine_room_has_no_viewport_and_takes_its_controls_from_home ... ok
2026-07-31T04:44:04.9876449Z test applyhost::tests::refresh_brain_cycles_without_staging_or_swap_preconditions ... ok
2026-07-31T04:44:04.9901647Z test applyhost::tests::apply_staged_gates_fail_closed_with_the_seat_untouched ... ok
2026-07-31T04:44:04.9941239Z test access::tests::gate_is_per_surface ... ok
2026-07-31T04:44:04.9955967Z test applyhost::tests::apply_staged_update_set_refuses_broker_touching_payloads ... ok
2026-07-31T04:44:04.9958366Z test brain::tests::a_flagged_sync_frame_baselines_forward_never_backward_on_both_paths ... ok
2026-07-31T04:44:04.9963514Z test brain::tests::an_old_broker_wire_without_the_sync_key_keeps_every_legacy_path ... ok
2026-07-31T04:44:04.9965486Z test brain::tests::cold_brain_still_rejects_a_forward_output_gap ... ok
2026-07-31T04:44:04.9967264Z test brain::tests::peer_reply_deadline_caps_below_carrier_deadline ... ok
2026-07-31T04:44:04.9968650Z test brain::tests::reclassify_peer_reply_maps_timeout_off_poison ... ok
2026-07-31T04:44:04.9982353Z test brain::tests::skip_to_live_accepts_a_forward_seq_jump_via_snap_above ... ok
2026-07-31T04:44:04.9991816Z test brain::tests::controller_resume_from_floor_refetches_after_a_gap ... ok
2026-07-31T04:44:05.0005776Z test brainproc::tests::appended_padding_flips_exe_hash ... ok
2026-07-31T04:44:05.0007959Z test brain::tests::viewer_snap_attach_accepts_a_forward_output_gap ... ok
2026-07-31T04:44:05.0008619Z test brainproc::tests::backoff_doubles_on_fast_death_resets_when_healthy ... ok
2026-07-31T04:44:05.0013709Z test brainproc::tests::bytes_gate_truth_table ... ok
2026-07-31T04:44:05.0014206Z test brainproc::tests::brain_child_args_carry_generation_and_reason ... ok
2026-07-31T04:44:05.0014703Z test brainproc::tests::consumer_gate_spawns_once_when_net_enabled ... ok
2026-07-31T04:44:05.0030207Z test applyhost::tests::apply_staged_daemonless_holds_the_fail_closed_gates ... ok
2026-07-31T04:44:05.0100229Z test applyhost::tests::apply_staged_without_broker_hosted_sessions_swaps_binary ... ok
2026-07-31T04:44:05.0217448Z test access::tests::same_node_always_passes_without_minting ... ok
2026-07-31T04:44:05.0374880Z test access::tests::the_engine_room_refuses_even_this_nodes_own_unsolicited_inbound ... ok
2026-07-31T04:44:05.0534401Z test access::tests::the_inbound_lock_is_reached_through_the_sender_stamped_entry_point ... ok
2026-07-31T04:44:05.0536107Z test brainproc::tests::ready_exe_hash_parses_and_is_n1_readable ... ok
2026-07-31T04:44:05.0608233Z test brainproc::tests::ready_generation_at_reads_file_and_absent_is_none ... ok
2026-07-31T04:44:05.0609665Z test brainproc::tests::ready_generation_parses_stamp_and_fails_safe ... ok
2026-07-31T04:44:05.0659124Z test access::tests::gate_decision_table ... ok
2026-07-31T04:44:05.0660698Z test brainproc::tests::rollback_running_version_is_prior_not_n_minus_one ... ok
2026-07-31T04:44:05.1503982Z test access::tests::the_engine_room_is_disclosed_only_to_the_viewers_it_chose ... ok
2026-07-31T04:44:05.1523858Z test brainproc::tests::select_brain_exe_prefers_canonical_over_per_spawn_current_exe ... ok
2026-07-31T04:44:05.1581479Z test attach::tests::viewer_and_driving_intents_gate_on_different_surfaces ... ok
2026-07-31T04:44:05.1584107Z test autostart::tests::empty_config_is_a_pure_noop ... ok
2026-07-31T04:44:05.1593021Z test brainproc::tests::start_reason_arg_round_trips_and_is_lenient ... ok
2026-07-31T04:44:05.1658772Z test autostart::tests::unresolved_adapter_loud_skips_before_any_launch ... ok
2026-07-31T04:44:05.1695042Z test applyhost::tests::apply_staged_swaps_binary_and_hands_off_without_touching_the_endpoint ... ok
2026-07-31T04:44:05.1747383Z test applyhost::tests::apply_staged_update_set_selects_local_platform_artifact ... ok
2026-07-31T04:44:05.3781641Z test applyhost::tests::apply_staged_refuses_platform_blind_or_mismatched_single ... ok
2026-07-31T04:44:05.3797794Z test broker::tests::a_controller_resume_below_the_floor_is_served_the_repaint_shape ... ok
2026-07-31T04:44:05.3801092Z test broker::tests::a_failed_surface_resize_leaves_the_grid_geometry_unchanged ... ok
2026-07-31T04:44:05.3817792Z test applyhost::tests::apply_staged_refuses_a_quarantined_version ... ok
2026-07-31T04:44:05.3818392Z test broker::tests::a_full_controller_does_not_starve_a_viewer_or_block_the_drain ... ok
2026-07-31T04:44:05.3821232Z test broker::tests::a_grow_keeps_old_geometry_wrapping_and_places_new_output_at_the_new_width ... ok
2026-07-31T04:44:05.3830729Z test broker::tests::a_gap_resume_on_the_same_conn_is_served_not_suppressed ... ok
2026-07-31T04:44:05.3844030Z test broker::tests::a_resume_at_the_floor_keeps_the_raw_ring_replay ... ok
2026-07-31T04:44:05.3858249Z test broker::tests::a_resumed_controller_never_rereceives_a_suppressed_seq ... ok
2026-07-31T04:44:05.3860458Z test broker::tests::a_second_transition_is_refused_while_one_is_in_flight ... ok
2026-07-31T04:44:05.3863246Z test broker::tests::a_shrink_parses_held_output_at_the_geometry_it_was_emitted_under ... ok
2026-07-31T04:44:05.4476308Z test broker::tests::a_reap_clears_the_control_stamps_but_never_the_hosting_authority ... ok
2026-07-31T04:44:05.6610348Z test broker::tests::a_take_and_a_detach_each_drop_the_engine_rooms_empowerments ... ok
2026-07-31T04:44:05.6611036Z test broker::tests::advance_delivered_is_monotonic ... ok
2026-07-31T04:44:05.6621950Z test broker::tests::an_aborted_transition_syncs_at_the_old_geometry_with_no_size_frame ... ok
2026-07-31T04:44:05.6628300Z test broker::tests::append_overflow_flags_the_evicted_viewer_for_skip_to_live ... ok
2026-07-31T04:44:05.6641915Z test broker::tests::apply_once_enqueues_ptywrite_exactly_once_and_dedups_replay ... ok
2026-07-31T04:44:05.8495633Z test broker::tests::a_viewer_below_the_floor_gets_the_repaint_and_skip_to_live_stays_empty ... ok
2026-07-31T04:44:05.8497429Z test broker::tests::chunk_text_splits_and_reassembles_exactly ... ok
2026-07-31T04:44:05.8510138Z test broker::tests::clamp_or_reset_resets_a_torn_ring_only ... ok
2026-07-31T04:44:05.8518145Z test broker::tests::cold_attach_repaint_plus_next_differential_matches_independent_emulator ... ok
2026-07-31T04:44:05.8519399Z test broker::tests::contains_subslice_finds_contiguous_only ... ok
2026-07-31T04:44:05.8520340Z test broker::tests::contiguous_advance_freezes_on_a_gap ... ok
2026-07-31T04:44:05.8528307Z test broker::tests::controller_write_stall_predicate_distinguishes_wedged_from_idle ... ok
2026-07-31T04:44:05.8529219Z test broker::tests::delivered_cursor_advances_only_on_ok_and_is_monotonic ... ok
2026-07-31T04:44:05.9725384Z test broker::tests::attach_initial_batch_is_a_clean_alt_screen_repaint_not_the_raw_ring ... ok
2026-07-31T04:44:05.9726481Z test broker::tests::echo_verified_catches_a_swallowed_head ... ok
2026-07-31T04:44:05.9740662Z test broker::tests::equal_generation_same_conn_is_an_idempotent_replay ... ok
2026-07-31T04:44:05.9751435Z test broker::tests::exit_enqueues_behind_queued_output_per_sink ... ok
2026-07-31T04:44:05.9762848Z test broker::tests::gap_resume_resubscribe_preserves_the_generation_against_stale_replay ... ok
2026-07-31T04:44:05.9782612Z test broker::tests::generation_ladder_newer_supersedes_loudly_older_refused_both_intents ... ok
2026-07-31T04:44:05.9784651Z test broker::tests::input_enqueue_drops_and_stamps_on_full_then_heals_on_drain ... ok
2026-07-31T04:44:05.9786846Z test broker::tests::input_writer_preserves_strict_fifo_order_through_the_sole_writer ... ok
2026-07-31T04:44:05.9811518Z test broker::tests::local_controller_wedged_scopes_to_the_brains_own_conn ... ok
2026-07-31T04:44:05.9816095Z test broker::tests::lock_floor_recovers_a_poisoned_inject_floor ... ok
2026-07-31T04:44:05.9818125Z test broker::tests::miss_respool_is_once_then_dead_letters ... ok
2026-07-31T04:44:05.9819238Z test broker::tests::miss_strikes_exhausted_at_budget ... ok
2026-07-31T04:44:05.9820516Z test broker::tests::only_the_supervised_generation_can_claim_the_coordinator_image ... ok
2026-07-31T04:44:05.9825038Z test broker::tests::output_log_tap_reads_bytes_since_snapshot ... ok
2026-07-31T04:44:05.9826202Z test broker::tests::pair_hold_lifecycle_decisions ... ok
2026-07-31T04:44:05.9827410Z test broker::tests::rc_input_fence_scopes_to_rc_minted_non_controller_input_only ... ok
2026-07-31T04:44:05.9906391Z test broker::tests::read_translation_command_none_when_absent ... ok
2026-07-31T04:44:06.0038146Z test broker::tests::read_translation_command_reads_declared ... ok
2026-07-31T04:44:06.0061686Z test broker::tests::reap_dead_controller_clears_a_finished_writer ... ok
2026-07-31T04:44:06.0069664Z test broker::tests::reap_dead_controller_leaves_a_live_writer_untouched ... ok
2026-07-31T04:44:06.0076684Z test broker::tests::reap_evicts_a_blocked_writer_not_only_an_exited_one ... ok
2026-07-31T04:44:06.0082631Z test broker::tests::recover_log_clamps_a_poisoned_torn_ring ... ok
2026-07-31T04:44:06.0085709Z test broker::tests::recover_reopens_a_poisoned_sessions_map ... ok
2026-07-31T04:44:06.0096856Z test broker::tests::revoked_incumbent_writer_emits_the_terminal_displaced ... ok
2026-07-31T04:44:06.0111028Z test broker::tests::same_identity_resubscribe_refuses_a_stale_generation ... ok
2026-07-31T04:44:06.0112512Z test broker::tests::select_endpoints_running_adapter_filters_dedups_sorts ... ok
2026-07-31T04:44:06.0114703Z test broker::tests::sessions_reply_resume_seq_defaults_when_absent ... ok
2026-07-31T04:44:06.0115148Z test broker::tests::should_settle_rearms_on_observable_pty ... ok
2026-07-31T04:44:06.0126133Z test broker::tests::stale_generation_detach_never_clears_the_newer_controller ... ok
2026-07-31T04:44:06.0855880Z test broker::tests::stale_snapshot_stamp_write_refused_after_reap_generation_bump ... ok
2026-07-31T04:44:06.0867689Z test broker::tests::stalled_incumbent_is_evicted_on_reattach_and_control_released ... ok
2026-07-31T04:44:06.0868637Z test broker::tests::stamp_divergence_gates_writes ... ok
2026-07-31T04:44:06.1898594Z test broker::tests::stamp_driven_by_latches_own_node_hex_verbatim_like_remote ... ok
2026-07-31T04:44:06.2658179Z test broker::tests::delivery_is_suppressed_during_a_transition_and_one_sync_frame_substitutes ... ok
2026-07-31T04:44:06.3321833Z test brainproc::tests::exe_hash_computed_exactly_once_across_n_publishes ... ok
2026-07-31T04:44:06.4145029Z test brainproc::tests::rolled_back_record_spawns_rollback_binary_on_a_fresh_supervisor ... ok
2026-07-31T04:44:06.4612078Z test broker::tests::taking_the_engine_rooms_controls_costs_a_member_or_admin_code ... ok
2026-07-31T04:44:06.4615797Z test broker::tests::the_suppressed_window_is_exempt_from_the_controller_eviction_deadline ... ok
2026-07-31T04:44:06.4625352Z test broker::tests::tracked_state_inside_the_window_surfaces_in_the_sync_frame ... ok
2026-07-31T04:44:06.4630474Z test broker::tests::untracked_toggles_defer_into_the_sync_frame_and_hyperlinks_drop ... ok
2026-07-31T04:44:06.4631871Z test broker::tests::viewer_overflow_or_disconnect_evicts_never_blocks ... ok
2026-07-31T04:44:06.5575513Z test broker::tests::the_engine_room_refuses_every_viewport_and_every_off_node_attach ... ok
2026-07-31T04:44:06.5576114Z test broker::tests::wake_gate_decision_truth_table ... ok
2026-07-31T04:44:06.6056985Z test broker::tests::superseded_controller_writer_is_epoch_gated_silent_one_live_writer_per_conn ... ok
2026-07-31T04:44:06.6057807Z test broker::tests::wrapper_alive_prefers_the_table_and_falls_back_where_there_is_none ... ok
2026-07-31T04:44:06.6058936Z test broker::tests::zombie_verdict_table ... ok
2026-07-31T04:44:06.6060997Z test codec::tests::back_to_back_frames_decode_independently ... ok
2026-07-31T04:44:06.6062281Z test codec::tests::frame_round_trips_through_buffer ... ok
2026-07-31T04:44:06.6063330Z test codec::tests::oversized_prefix_rejected ... ok
2026-07-31T04:44:06.6130883Z test config::tests::auto_suspend_knob_is_opt_in_default_off ... ok
2026-07-31T04:44:06.6191167Z test config::tests::crash_grace_is_config_driven ... ok
2026-07-31T04:44:06.6251576Z test config::tests::detached_subnets_knob_defaults_empty ... ok
2026-07-31T04:44:06.6308729Z test config::tests::full_auto_update_is_gated_by_default ... ok
2026-07-31T04:44:06.6363637Z test config::tests::malformed_file_degrades_to_default ... ok
2026-07-31T04:44:06.6368896Z test config::tests::missing_file_is_default ... ok
2026-07-31T04:44:06.6425045Z test config::tests::pulse_period_is_config_driven ... ok
2026-07-31T04:44:06.6585908Z test config::tests::relay_choice_is_config_driven ... ok
2026-07-31T04:44:06.6646749Z test config::tests::save_load_roundtrip ... ok
2026-07-31T04:44:06.6755355Z test config::tests::startup_endpoints_roundtrip ... ok
2026-07-31T04:44:06.6975009Z test config::tests::upsert_startup_endpoint_appends_then_replaces_preserving_other_knobs ... ok
2026-07-31T04:44:06.6979194Z test conn::tests::conn_ids_are_unique_and_labels_stay_bounded ... ok
2026-07-31T04:44:06.6983624Z test conn::tests::organic_write_failure_still_poisons_and_is_not_the_timeout_class ... ok
2026-07-31T04:44:06.6986383Z test conn::tests::retirement_token_splits_deadline_from_organic_with_attribution_parity ... ok
2026-07-31T04:44:06.6987649Z test consent::tests::decide_honors_full_auto_flag ... ok
2026-07-31T04:44:06.7364096Z test consent::tests::no_live_session_resolves_to_none ... ok
2026-07-31T04:44:06.7657993Z test brainproc::tests::planned_restart_respawns_with_update_reason ... ok
2026-07-31T04:44:06.7841410Z test brainproc::tests::ready_but_wrong_bytes_rolls_back_never_promotes ... ok
2026-07-31T04:44:06.7841946Z test crc_swap::tests::apply_rollback_never_strands ... ok
2026-07-31T04:44:06.7951702Z test brainproc::tests::clear_before_spawn_defeats_exact_generation_stale_file ... ok
2026-07-31T04:44:06.7956053Z test crc_swap::tests::crash_recovery_missing_target_keeps_last_good_old ... ok
2026-07-31T04:44:06.7956490Z test brainproc::tests::ready_but_old_gen_never_drains_does_not_promote_rolls_back ... ok
2026-07-31T04:44:06.8000002Z test brainproc::tests::ready_candidate_promotes_once_old_gen_drains ... ok
2026-07-31T04:44:06.8082680Z test brainproc::tests::ready_with_matching_bytes_promotes ... ok
2026-07-31T04:44:06.8117677Z test crc_swap::tests::apply_swaps_changed_creates_new_untouched_identical ... ok
2026-07-31T04:44:06.8121985Z test crc_swap::tests::displace_picks_fresh_old_name_and_gc_sweeps_stale ... ok
2026-07-31T04:44:06.8203990Z test crc_swap::tests::swap_error_carries_op_and_paths ... ok
2026-07-31T04:44:06.8257132Z test crc_swap::tests::plan_recurses_nested_dirs ... ok
2026-07-31T04:44:06.8265669Z test crc_swap::tests::plan_selects_only_changed ... ok
2026-07-31T04:44:06.8560434Z test broker::tests::supervised_worker_panic_faults_and_reaps_child ... ok
2026-07-31T04:44:06.8561979Z test daemon::tests::drive_ladder_all_err_returns_last_err ... ok
2026-07-31T04:44:06.8564765Z test daemon::tests::drive_ladder_falls_through_to_next_rung_on_err ... ok
2026-07-31T04:44:06.8567250Z test daemon::tests::drive_ladder_picks_first_ok_rung ... ok
2026-07-31T04:44:06.8575517Z test daemon::tests::ensure_declines_only_against_a_standing_operator_stop ... ok
2026-07-31T04:44:06.8596600Z test daemon::tests::a_scrubbed_variable_never_reaches_the_child ... ok
2026-07-31T04:44:06.8660239Z test daemon::tests::breakaway_spawn_escapes_a_kill_on_close_job ... ok
2026-07-31T04:44:06.8662707Z test daemon::tests::launch_ladder_order_is_wmi_schtasks_breakaway_injob ... ok
2026-07-31T04:44:06.8665322Z test daemon::tests::net_retry_backoff_doubles_then_caps ... ok
2026-07-31T04:44:06.8666946Z test daemon::tests::null_std_handles_only_on_a_pipe_stderr ... ok
2026-07-31T04:44:06.8717979Z test daemon::tests::implicit_ensure_declines_without_clearing_the_inhibit ... ok
2026-07-31T04:44:06.8720070Z test daemon::tests::the_refusal_line_names_the_remedy ... ok
2026-07-31T04:44:06.8721835Z test daemon::tests::windows_arg_quoting_roundtrips_the_rules ... ok
2026-07-31T04:44:06.8723430Z test daemon::tests::wmi_create_script_carries_the_no_window_startup_spec ... ok
2026-07-31T04:44:06.8725233Z test deadline::tests::advance_after_fire_steps_one_grid_normally_and_collapses_a_stall ... ok
2026-07-31T04:44:06.8802411Z test consent::tests::resolves_most_recently_active_live_session ... ok
2026-07-31T04:44:06.8995039Z test broker::tests::windows_session_is_zombie_sees_a_handle_held_corpse_as_dead ... ok
2026-07-31T04:44:06.9064942Z test daemon::tests::spawn_env_additions_reach_the_child_and_keep_the_inherited_environment ... ok
2026-07-31T04:44:06.9065964Z test deadline::tests::next_fire_between_grid_points_rounds_up ... ok
2026-07-31T04:44:06.9067315Z test deadline::tests::next_fire_long_jump_collapses_missed_ticks_to_one ... ok
2026-07-31T04:44:06.9068478Z test deadline::tests::next_fire_on_grid_returns_now_and_advances_strictly ... ok
2026-07-31T04:44:06.9069383Z test deadline::tests::next_fire_saturates_when_now_precedes_anchor ... ok
2026-07-31T04:44:06.9070487Z test deadline::tests::one_shot_fires_at_or_after_target_and_never_resets ... ok
2026-07-31T04:44:07.0094773Z test daemon::tests::a_tree_teardown_reaches_a_grandchild_the_service_spawned ... ok
2026-07-31T04:44:07.0211897Z test crc_swap::tests::mapped_old_does_not_brick_apply_displaces_aside ... ok
2026-07-31T04:44:07.0212989Z test deadline::tests::zero_interval_degrades_to_config_default ... ok
2026-07-31T04:44:07.0215532Z test deelevate::tests::env_overlay_keeps_explicit_spt_home_alive ... ok
2026-07-31T04:44:07.0217099Z test deelevate::tests::plan_spawn_deelevates_only_with_a_target ... ok
2026-07-31T04:44:07.0218793Z test digest::tests::common_prefix_len_finds_the_unchanged_head ... ok
2026-07-31T04:44:07.0232117Z test daemon::tests::detached_no_inherit_falls_back_under_a_breakaway_denying_job ... ok
2026-07-31T04:44:07.1409557Z test brainproc::tests::trial_promotes_on_ready_then_supervises_the_accepted_binary ... ok
2026-07-31T04:44:07.1411163Z test digest::tests::merge_by_ts_interleaves_context ... ok
2026-07-31T04:44:07.1550781Z test brainproc::tests::stale_generation_minus_one_ready_never_promotes ... ok
2026-07-31T04:44:07.1822403Z test brainproc::tests::supervisor_owns_generation_and_stamps_start_reason ... ok
2026-07-31T04:44:07.1823380Z test digest::tests::resolve_config_precedence ... ok
2026-07-31T04:44:07.1825482Z test digest::tests::supersede_collapses_cross_generation_replay_to_newest ... ok
2026-07-31T04:44:07.1826852Z test digest::tests::supersede_is_noop_on_disjoint_sessions ... ok
2026-07-31T04:44:07.1828346Z test digest::tests::supersede_keeps_within_generation_repeats ... ok
2026-07-31T04:44:07.1829784Z test digest::tests::supersede_trims_divider_around_emptied_middle_generation ... ok
2026-07-31T04:44:07.1831764Z test digesthub::tests::dropped_subscriber_is_pruned ... ok
2026-07-31T04:44:07.1833337Z test digesthub::tests::project_and_publish_stores_latest ... ok
2026-07-31T04:44:07.1834788Z test digesthub::tests::publish_delta_is_tail_then_full_refresh ... ok
2026-07-31T04:44:07.1836769Z test digesthub::tests::render_is_glanceable ... ok
2026-07-31T04:44:07.1838320Z test digesthub::tests::subscribe_returns_current_base ... ok
2026-07-31T04:44:07.1839651Z test dispatch::tests::breaker_trips_with_doubling_capped_window_and_resets_on_progress ... ok
2026-07-31T04:44:07.1841575Z test dispatch::tests::classifies_every_family_by_first_line_shape ... ok
2026-07-31T04:44:07.1843612Z test dispatch::tests::classify_failure_seat_blocked_is_exactly_the_three_discipline_strings ... ok
2026-07-31T04:44:07.1844693Z test dispatch::tests::cold_enumeration_claims_at_most_the_pool_bound_per_poll ... ok
2026-07-31T04:44:07.1846687Z test dispatch::tests::digest_pull_and_rest_never_read_as_each_other ... ok
2026-07-31T04:44:07.1848210Z test dispatch::tests::dispatch_event_carries_the_complete_key_set ... ok
2026-07-31T04:44:07.1849774Z test dispatch::tests::feed_accumulator_commits_per_bound_never_per_chunk ... ok
2026-07-31T04:44:07.1850844Z test dispatch::tests::finished_is_terminal_for_attach_only ... ok
2026-07-31T04:44:07.1852351Z test dispatch::tests::line_endpoint_resolves_each_family_identity_key ... ok
2026-07-31T04:44:07.1853654Z test dispatch::tests::oneway_seatblocked_strikes_out_terminal_while_request_reply_paces_forever ... ok
2026-07-31T04:44:07.1855152Z test dispatch::tests::only_the_old_broker_unknown_verb_answer_falls_back_to_the_peek ... ok
2026-07-31T04:44:07.1856478Z test dispatch::tests::seat_blocked_requeues_budget_free_paced_by_the_breaker_window ... ok
2026-07-31T04:44:07.1857581Z test dispatch::tests::transient_failure_requeues_bounded_and_terminal_never_reenters ... ok
2026-07-31T04:44:07.1859017Z test dispatch::tests::unknown_shapes_refuse_classification ... ok
2026-07-31T04:44:07.1860336Z test docshost::tests::content_types_cover_the_bundle_classes ... ok
2026-07-31T04:44:07.1861665Z test docshost::tests::port_resolution_env_config_default ... ok
2026-07-31T04:44:07.1863579Z test docshost::tests::sanitizer_admits_pages_and_rejects_escapes ... ok
2026-07-31T04:44:07.1866337Z test drivehub::tests::a_following_op_is_served_when_nothing_refused ... ok
2026-07-31T04:44:07.1872842Z test drivehub::tests::a_foreign_owlery_is_refused_pre_ack_under_its_own_name ... ok
2026-07-31T04:44:07.1874165Z test drivehub::tests::activity_and_drive_never_clobber_each_other ... ok
2026-07-31T04:44:07.1875748Z test drivehub::tests::activity_take_is_latest_wins_and_exactly_once ... ok
2026-07-31T04:44:07.1877652Z test drivehub::tests::an_unknown_op_hangs_up_instead_of_being_swallowed ... ok
2026-07-31T04:44:07.1879219Z test drivehub::tests::clear_evicts_both_classes ... ok
2026-07-31T04:44:07.1880158Z test drivehub::tests::clear_evicts_the_slot ... ok
2026-07-31T04:44:07.1881645Z test drivehub::tests::dead_generation_activity_frame_is_never_served ... ok
2026-07-31T04:44:07.1883071Z test drivehub::tests::dead_generation_frame_is_never_served ... ok
2026-07-31T04:44:07.1884721Z test drivehub::tests::drive_result_activity_key_is_additive_on_the_wire ... ok
2026-07-31T04:44:07.1885955Z test drivehub::tests::only_a_pre_ack_refusal_permits_a_second_spawn ... ok
2026-07-31T04:44:07.1887301Z test drivehub::tests::slots_are_per_owner ... ok
2026-07-31T04:44:07.1888522Z test drivehub::tests::take_is_exactly_once ... ok
2026-07-31T04:44:07.1890032Z test drivehub::tests::the_launch_reply_shapes_round_trip ... ok
2026-07-31T04:44:07.1927023Z test brainproc::tests::supervisor_respawns_brain_until_stopped ... ok
2026-07-31T04:44:07.1928293Z test drivehub::tests::write_is_latest_wins ... ok
2026-07-31T04:44:07.2140264Z test effect::tests::applied_set_survives_reopen ... ok
2026-07-31T04:44:07.2152587Z test effect::tests::apply_once_does_not_hold_the_journal_lock_across_effect ... ok
2026-07-31T04:44:07.2621309Z test brainproc::tests::trial_kills_alive_never_ready_candidate_before_rollback ... ok
2026-07-31T04:44:07.2937148Z test effect::tests::each_named_minter_namespaces_its_ops ... ok
2026-07-31T04:44:07.2985404Z test effect::tests::failed_effect_is_not_recorded_applied ... ok
2026-07-31T04:44:07.2986823Z test effect::tests::marker_is_single_source_and_frozen ... ok
2026-07-31T04:44:07.2988393Z test effect::tests::minter_tag_round_trips ... ok
2026-07-31T04:44:07.3010804Z test effect::tests::open_creates_missing_parent_dirs ... ok
2026-07-31T04:44:07.3318913Z test effect::tests::poisoned_journal_lock_still_applies_subsequent_ops ... ok
2026-07-31T04:44:07.3638137Z test effect::tests::ptywrite_skips_the_durable_journal_write_while_netsend_persists ... ok
2026-07-31T04:44:07.3823017Z test effect::tests::recover_is_migration_free ... ok
2026-07-31T04:44:07.3832722Z test effect::tests::second_apply_for_same_key_is_deduped ... ok
2026-07-31T04:44:07.4121072Z test effect::tests::shellchan_and_rc_same_session_dont_collide ... ok
2026-07-31T04:44:07.4122325Z test effect::tests::with_tracing_retry_no_retry_on_success ... ok
2026-07-31T04:44:07.4123572Z test effect::tests::with_tracing_retry_passes_through_other_errors ... ok
2026-07-31T04:44:07.4125177Z test effect::tests::with_tracing_retry_retries_once_on_no_longer_held ... ok
2026-07-31T04:44:07.4126384Z test effect::tests::with_tracing_retry_terminal_is_public_language ... ok
2026-07-31T04:44:07.4128528Z test frame::tests::envelope_with_unknown_trailing_field_decodes_on_older_peer ... ok
2026-07-31T04:44:07.4130123Z test frame::tests::handshake_accepts_newer_brain_on_older_broker ... ok
2026-07-31T04:44:07.4131349Z test frame::tests::handshake_rejects_below_floor ... ok
2026-07-31T04:44:07.4132670Z test frame::tests::handshake_rejects_role_mismatch ... ok
2026-07-31T04:44:07.4134163Z test frame::tests::unknown_kind_is_not_a_decode_error ... ok
2026-07-31T04:44:07.4135593Z test grants::tests::escalation_answers_apply ... ok
2026-07-31T04:44:07.4137448Z test grants::tests::escalation_ask_body_roundtrip ... ok
2026-07-31T04:44:07.4441672Z test effect::tests::gauntlet_is_exactly_once_across_brain_crashes ... ok
2026-07-31T04:44:07.4442786Z test grants::tests::no_session_escalates_with_none_target ... ok
2026-07-31T04:44:07.4444054Z test grants::tests::preconsent_flags_author_grants ... ok
2026-07-31T04:44:07.4445344Z test grants::tests::reserved_capabilities_refuse_even_when_granted ... ok
2026-07-31T04:44:07.4446543Z test grants::tests::ungranted_escalates_granted_allows ... ok
2026-07-31T04:44:07.4450224Z test harnesshost::tests::mint_session_id_is_fresh_hex ... ok
2026-07-31T04:44:07.4454998Z test harnesshost::tests::node_key_fills_advertised_label_in_session_template ... ok
2026-07-31T04:44:07.4458091Z test harnesshost::tests::node_missing_reference_fails_loud ... ok
2026-07-31T04:44:07.4465530Z test harnesshost::tests::prepare_fails_closed_on_wrong_kind_missing_role_and_bad_template ... ok
2026-07-31T04:44:07.4466236Z test harnesshost::tests::prepare_fills_env_inject_values_with_substitution ... ok
2026-07-31T04:44:07.4469490Z test harnesshost::tests::prepare_fills_id_and_session_into_self_command ... ok
2026-07-31T04:44:07.4472462Z test harnesshost::tests::prepare_resume_falls_back_to_self_when_no_resume_role ... ok
2026-07-31T04:44:07.4475798Z test harnesshost::tests::prepare_selects_resume_template_on_resume_else_self ... ok
2026-07-31T04:44:07.4482106Z test harnesshost::tests::prepare_threads_translation_binary_when_declared ... ok
2026-07-31T04:44:07.4484566Z test harnesshost::tests::provisional_session_id_recognizes_own_mint_only ... ok
2026-07-31T04:44:07.4500060Z test harnesshost::tests::translation_binary_resolves_against_install_dir ... ok
2026-07-31T04:44:07.5006357Z test drivehub::tests::the_pre_ack_causes_are_three_distinct_diagnostics ... ok
2026-07-31T04:44:07.5920047Z test brainproc::tests::trial_rolls_back_after_budget_of_pre_ready_exits ... ok
2026-07-31T04:44:08.4778336Z test broker::tests::viewer_writer_emits_evicted_marker_only_on_an_evicted_close ... ok
2026-07-31T04:44:11.8665644Z test daemon::tests::a_captured_spawn_inherits_only_the_handle_in_its_allowlist ... FAILED
2026-07-31T04:44:12.9265825Z test daemon::tests::is_running_tracks_the_seed_channel ... ok
2026-07-31T04:44:12.9330247Z test deadline::tests::cold_and_crash_write_fresh_anchor_at_now ... ok
2026-07-31T04:44:12.9389796Z test deadline::tests::corrupt_file_degrades_to_fresh ... ok
2026-07-31T04:44:12.9408369Z test deadline::tests::distinct_keys_do_not_cross_clobber ... ok
2026-07-31T04:44:12.9409877Z test lifecycle::tests::event_turn_timeout_floors_at_thirty_seconds ... ok
2026-07-31T04:44:12.9412768Z test lifecycle::tests::first_turn_psyche_context_is_never_empty ... ok
2026-07-31T04:44:12.9429685Z test deadline::tests::update_keeps_anchor_and_refreshes_interval ... ok
2026-07-31T04:44:12.9431286Z test lifecycle::tests::is_owlery_internal_cases ... ok
2026-07-31T04:44:12.9439121Z test deadline::tests::update_with_no_file_falls_back_fresh ... ok
2026-07-31T04:44:13.2344555Z test digest::tests::extractor_spans_sessions_with_a_boundary_marker ... ok
2026-07-31T04:44:13.2560265Z test digest::tests::log_less_two_origin_merge_interleaves_by_ts ... ok
2026-07-31T04:44:13.2754088Z test digest::tests::projects_a_log_less_endpoint_from_digest_log ... ok
2026-07-31T04:44:13.2762387Z test digest::tests::projects_empty_for_a_sourceless_endpoint ... ok
2026-07-31T04:44:13.2764375Z test lifecycle::tests::psyche_turn_keys_carry_custody_sids_and_context_file_path ... ok
2026-07-31T04:44:13.2765824Z test lifecycle::tests::psyche_turn_strikes_exhausted_boundary ... ok
2026-07-31T04:44:13.2832939Z test lifecycle::tests::psyche_context_file_continue_is_zero_bytes_fresh_is_nonempty ... ok
2026-07-31T04:44:13.5624206Z test grants::tests::escalation_notif_fires_to_most_recent_and_roundtrips ... ok
2026-07-31T04:44:13.7588277Z test inject::tests::has_parked_idle_spool_gates_on_idle_hosted_and_pending ... ok
2026-07-31T04:44:13.9320294Z test inject::tests::shared_inject_leg_detects_spt_hosted ... ok
2026-07-31T04:44:13.9693924Z test lifecycle::tests::base_keys_carries_single_subnet_no_home ... ok
2026-07-31T04:44:14.1461265Z test lifecycle::tests::crash_signoff_spares_recovered_self ... ok
2026-07-31T04:44:14.6041889Z test lifecycle::tests::crash_signoff_tears_down_when_still_gone ... ok
2026-07-31T04:44:14.6847518Z test lifecycle::tests::custody_survives_parent_boundary_and_reseed_clears ... ok
2026-07-31T04:44:14.7703068Z test lifecycle::tests::echo_fire_resolves_relative_commune_dir_against_endpoint_cwd ... ok
2026-07-31T04:44:14.7819361Z test lifecycle::tests::echo_fire_skips_loud_on_relative_dir_without_cwd ... ok
2026-07-31T04:44:14.8139866Z test lifecycle::tests::harness_owner_gone_anchors_on_parent_pid ... ok
2026-07-31T04:44:14.8142534Z test lifecycle::tests::resolve_endpoint_drop_dir_cases ... ok
2026-07-31T04:44:14.8165998Z test lifecycle::tests::manifest_cell_refresh_swaps_manifest_and_runtime ... ok
2026-07-31T04:44:14.8185801Z test lifecycle::tests::node_key_fills_advertised_label_in_lifecycle_base_keys ... ok
2026-07-31T04:44:15.0791291Z test lifecycle::tests::orphan_watch_fires_on_dead_owner ... ok
2026-07-31T04:44:15.0792367Z test lifecycle::tests::session_not_found_discriminates_reseed_from_strike ... ok
2026-07-31T04:44:15.0888228Z test lifecycle::tests::orphan_watch_honors_stop_for_live_owner ... ok
2026-07-31T04:44:15.2162418Z test lifecycle::tests::psyche_turn_threads_parent_read_env_into_spawn ... ok
2026-07-31T04:44:15.2490708Z test lifecycle::tests::pulse_loop_does_not_write_anchor_per_fire ... ok
2026-07-31T04:44:15.2957634Z test lifecycle::tests::pulse_loop_is_config_paced_and_killable ... ok
2026-07-31T04:44:15.2963675Z test linkhost::tests::per_capability_act_gate_blocks_until_class_scoped_grant ... ok
2026-07-31T04:44:15.3438422Z test lifecycle::tests::pulse_loop_update_preserves_phase_crash_rebases ... ok
2026-07-31T04:44:15.3929801Z test lifecycle::tests::pulse_recency_and_auto_suspend_follow_resting_state ... ok
2026-07-31T04:44:17.3420696Z test lifecycle::tests::pulse_tick_ingests_drop ... ok
2026-07-31T04:44:28.5667450Z test lifecycle::tests::relative_commune_dir_resolves_against_endpoint_cwd_and_fills_project_branch ... ok
2026-07-31T04:44:28.5808934Z test lifecycle::tests::reload_fires_on_disk_change ... ok
2026-07-31T04:44:28.5983092Z test lifecycle::tests::reload_keeps_last_good_on_unparseable ... ok
2026-07-31T04:44:28.6051884Z test lifecycle::tests::reload_noop_when_unchanged ... ok
2026-07-31T04:44:28.6062963Z test lifecycle::tests::reload_noop_without_install_dir ... ok
2026-07-31T04:44:28.6064801Z test livehost::tests::decide_resume_goal_table ... ok
2026-07-31T04:44:28.6899432Z test lifecycle::tests::rest_edge_echo_success_clears_stale_psyche_stamp ... ok
2026-07-31T04:44:28.6900554Z test livehost::tests::hybrid_self_heal_due_table ... ok
2026-07-31T04:44:28.7115583Z test livehost::tests::legacy_psyche_sweep_guard_is_id_specific_and_fail_safe ... ok
2026-07-31T04:44:28.7330530Z test livehost::tests::live_bin_gc_removes_own_copy_and_displaces_when_locked ... ok
2026-07-31T04:44:29.2123423Z test lifecycle::tests::rest_event_fires_echo_once_and_wake_resurfaces ... ok
2026-07-31T04:44:30.5569560Z test lifecycle::tests::role_less_manifest_ticks_strike_free ... ok
2026-07-31T04:44:30.6650343Z test lifecycle::tests::thrash_budget_trips_on_a_synthetic_failure_loop_without_touching_status ... ok
2026-07-31T04:44:30.7110171Z test lifecycle::tests::turn_budget_stamps_on_exhaustion_and_clears_on_success ... ok
2026-07-31T04:44:31.3821370Z test linkhost::tests::cmd_wakes_a_stale_online_persistent_instance ... ok
2026-07-31T04:44:35.2815152Z test linkhost::tests::gateway_typed_owner_resolves_and_drives_keyed_on_id_not_type ... ok
2026-07-31T04:44:35.4961970Z test linkhost::tests::prepare_drive_is_live_or_drop_and_never_spools ... ok
2026-07-31T04:44:35.6618303Z test linkhost::tests::relink_refuses_a_live_instance_but_recovers_a_stale_online_one ... ok
2026-07-31T04:44:35.7801591Z test linkhost::tests::run_action_drive_drops_offline_without_wake_or_spool ... ok
2026-07-31T04:44:35.9504916Z test linkhost::tests::run_action_refuses_gated_op_without_spooling ... ok
2026-07-31T04:44:36.7017170Z test linkhost::tests::run_action_relinks_drives_and_refuses ... ok
2026-07-31T04:44:36.8165802Z test livehost::tests::boot_gate_offlines_sessionless_controllable_then_reconcile_skips_host ... ok
2026-07-31T04:44:36.8166597Z test livehost::tests::reconcile_routing_controllable_falls_through_to_broker_session_truth ... ok
2026-07-31T04:44:36.8832064Z test livehost::tests::broker_failure_skips_the_pass_never_mass_offlines ... ok
2026-07-31T04:44:36.9586838Z test livehost::tests::control_reap_clears_sticky_controlled_on_already_offline_perch ... ok
2026-07-31T04:44:37.0228640Z test livehost::tests::fresh_brain_rehydrates_an_online_live_endpoint ... ok
2026-07-31T04:44:37.0229904Z test livehost::tests::restart_resume_gate_reruns_the_orphaned_controllable_dead_set_regardless_of_state ... ok
2026-07-31T04:44:37.8532300Z test livehost::tests::pull_liveness_demotes_a_relay_held_endpoint_instead_of_offlining_it ... ok
2026-07-31T04:44:37.8534092Z test machineid::tests::hash_is_domain_separated_and_stable ... ok
2026-07-31T04:44:38.1294861Z test livehost::tests::pull_liveness_marks_sessionless_spt_hosted_offline_only ... ok
2026-07-31T04:44:38.1296307Z test msg::tests::bytes_round_trip_through_payload ... ok
2026-07-31T04:44:38.1299641Z test msg::tests::endpoint_injected_envelope_carries_delivered_and_spool_hint ... ok
2026-07-31T04:44:38.1301255Z test msg::tests::endpoint_input_frames_round_trip ... ok
2026-07-31T04:44:38.1302831Z test msg::tests::evicted_envelope_round_trips ... ok
2026-07-31T04:44:38.1305063Z test msg::tests::input_req_absent_ack_defaults_true_n_minus_1_safe ... ok
2026-07-31T04:44:38.1306813Z test msg::tests::input_req_ack_false_round_trips_faithfully ... ok
2026-07-31T04:44:38.1309190Z test msg::tests::net_frames_round_trip_and_tolerate_unknown_fields ... ok
2026-07-31T04:44:38.1310783Z test msg::tests::output_envelope_round_trips ... ok
2026-07-31T04:44:38.1312447Z test msg::tests::output_sync_flag_defaults_absent_and_skips_when_false ... ok
2026-07-31T04:44:38.1314459Z test msg::tests::presence_event_round_trips_and_tolerates_future_kind ... ok
2026-07-31T04:44:38.1316021Z test msg::tests::spawn_req_tolerates_unknown_field ... ok
2026-07-31T04:44:38.1317664Z test msg::tests::stream_lifetime_is_additive_and_defaults_durable ... ok
2026-07-31T04:44:38.1319614Z test msg::tests::two_phase_join_wire_round_trips ... ok
2026-07-31T04:44:38.1321387Z test msg::tests::wire_decodes_old_shape_to_legacy ... ok
2026-07-31T04:44:38.1380340Z test nethost::tests::append_halts_at_first_failed_write_removes_the_seat_and_cancels_the_lease ... ok
2026-07-31T04:44:38.1386726Z test nethost::tests::attach_replay_never_interleaves_with_concurrent_live_appends ... ok
2026-07-31T04:44:38.1393482Z test nethost::tests::begin_attach_refuses_only_while_a_poisoned_prior_still_drains ... ok
2026-07-31T04:44:38.3486310Z test nethost::tests::bounded_block_on_cuts_a_never_completing_op_with_an_ordinary_error ... ok
2026-07-31T04:44:38.5375522Z test nethost::tests::conn_close_sweeps_its_stream_rows ... ok
2026-07-31T04:44:38.5556160Z test nethost::tests::dispatch_stream_infos_excludes_local_and_retired_rows_server_side ... ok
2026-07-31T04:44:38.5614710Z test nethost::tests::displaced_writer_failure_never_cancels_the_successor_lease ... ok
2026-07-31T04:44:38.5670607Z test nethost::tests::finish_halts_and_removes_a_poisoned_seat ... ok
2026-07-31T04:44:38.5862908Z test nethost::tests::host_binds_endpoint_to_node_identity ... ok
2026-07-31T04:44:38.6541143Z test nethost::tests::loopback_conn_is_a_reused_singleton_that_cross_wires_a_stream_pair ... ok
2026-07-31T04:44:38.8598048Z test livehost::tests::pull_reconcile_offlines_perch_when_broker_session_dies ... ok
2026-07-31T04:44:38.8599862Z test nethost::tests::next_seq_counts_appends_not_logical_chunks ... ok
2026-07-31T04:44:38.8801689Z test nethost::tests::op_maps_are_minter_namespaced ... ok
2026-07-31T04:44:38.9608479Z test nethost::tests::open_class_routes_to_the_opener_row_only ... ok
2026-07-31T04:44:38.9612726Z test nethost::tests::opener_capture_gives_up_bounded_on_a_newline_less_stream ... ok
2026-07-31T04:44:38.9614645Z test nethost::tests::opener_pins_first_line_across_full_ring_roll ... ok
2026-07-31T04:44:38.9693417Z test nethost::tests::overflow_detaches_without_lease_cancel_and_the_brain_resumes_from_cursor ... ok
2026-07-31T04:44:38.9758228Z test nethost::tests::presence_log_mirrors_the_seat_discipline ... ok
2026-07-31T04:44:38.9759822Z test nethost::tests::retentive_log_is_lossless_ordered_while_ordinary_log_overwrites ... ok
2026-07-31T04:44:38.9790034Z test livehost::tests::reconcile_attempts_resume_for_a_registered_woken_endpoint ... ok
2026-07-31T04:44:39.0033584Z test nethost::tests::retire_sweep_dismisses_the_seat_and_terminal_retire_drops_the_row ... ok
2026-07-31T04:44:39.0080052Z test nethost::tests::retire_hides_the_row_while_active_rows_stay ... ok
2026-07-31T04:44:39.0338161Z test nethost::tests::send_stream_refuses_on_a_canceled_lease ... ok
2026-07-31T04:44:39.0388107Z test nethost::tests::retired_row_still_flushes_a_late_reply ... ok
2026-07-31T04:44:39.0661487Z test nethost::tests::unsubscribe_releases_only_the_callers_seat_joins_writer_and_is_idempotent ... ok
2026-07-31T04:44:39.0925030Z test nethost::tests::two_hosts_dial_over_loopback ... ok
2026-07-31T04:44:39.2279670Z test livehost::tests::reconcile_converges_a_dead_relay_and_spares_a_live_or_unproven_one ... ok
2026-07-31T04:44:39.2764229Z test livehost::tests::reconcile_does_not_double_host ... ok
2026-07-31T04:44:39.3562466Z test livehost::tests::reconcile_hosts_an_online_live_endpoint_and_drives_its_pulse ... ok
2026-07-31T04:44:39.4015423Z test livehost::tests::reconcile_keeps_driver_on_transient_read_fail_unhosts_on_dir_gone ... ok
2026-07-31T04:44:39.4468214Z test livehost::tests::reconcile_leaves_a_genuinely_suspended_endpoint_alone ... ok
2026-07-31T04:44:39.5469285Z test livehost::tests::reconcile_marks_unbound_skeleton_offline_on_session_death ... ok
2026-07-31T04:44:39.7167958Z test livehost::tests::reconcile_reaps_orphaned_worker_and_spares_live_parent ... ok
2026-07-31T04:44:39.7595817Z test livehost::tests::reconcile_refuses_a_woken_endpoint_with_an_unregistered_adapter ... ok
2026-07-31T04:44:39.7763170Z test livehost::tests::reconcile_skips_a_woken_endpoint_with_no_ledger_row ... ok
2026-07-31T04:44:39.8097691Z test livehost::tests::reconcile_skips_an_offline_live_endpoint ... ok
2026-07-31T04:44:39.8666771Z test livehost::tests::reconcile_unhosts_on_offline_transition ... ok
2026-07-31T04:44:39.9580894Z test nethost::tests::loopback_tunnel_backpressures_without_loss ... ok
2026-07-31T04:44:39.9616807Z test livehost::tests::split_cleanup_clears_all_three_stamps_on_state_quirk_rows ... ok
2026-07-31T04:44:39.9621966Z test machineid::tests::machine_id_hash_resolves_and_is_stable ... ok
2026-07-31T04:44:39.9623936Z test notifgate::tests::an_unvalidatable_notify_passes ... ok
2026-07-31T04:44:39.9625665Z test notifgate::tests::distinct_notifs_both_deliver ... ok
2026-07-31T04:44:40.0465704Z test notifgate::tests::retain_preserves_order_of_the_survivors ... ok
2026-07-31T04:44:40.0467778Z test notifgate::tests::the_validity_gate_decision_table ... ok
2026-07-31T04:44:40.2472484Z test notifsync::tests::concurrent_dismiss_and_surface_commute_across_the_feed ... ok
2026-07-31T04:44:40.2646294Z test notif::tests::consent_decision_produces_notif_only_when_gated ... ok
2026-07-31T04:44:40.4534320Z test notifsync::tests::node_scoped_rows_are_excluded_from_the_feed ... ok
2026-07-31T04:44:40.4537746Z test notifsync::tests::feed_converges_two_stores_and_dismiss_replicates ... ok
2026-07-31T04:44:40.5270435Z test notif::tests::expired_row_is_auto_dismissed_at_boundary_not_surfaced ... ok
2026-07-31T04:44:40.5271962Z test pairhost::tests::a_re_postured_subnet_advises_and_never_applies ... ok
2026-07-31T04:44:40.6316625Z test notifsync::tests::non_member_subnet_record_never_materializes ... ok
2026-07-31T04:44:40.6317448Z test pairhost::tests::joiner_clock_render_shows_step_offset_and_state ... ok
2026-07-31T04:44:40.6318814Z test pairhost::tests::meet_failure_detail_concise_vs_verbose ... ok
2026-07-31T04:44:40.6321308Z test pairhost::tests::meet_final_retry_failing_surrenders_once ... ok
2026-07-31T04:44:40.6323293Z test pairhost::tests::meet_retries_once_after_refresh_on_exhaustion ... ok
2026-07-31T04:44:40.6324529Z test pairhost::tests::the_advisory_says_nothing_was_applied ... ok
2026-07-31T04:44:40.6325738Z test pairhost::tests::wire_errors_classify_for_the_guided_ux ... ok
2026-07-31T04:44:40.6528687Z test notifsync::tests::untrusted_and_cross_subnet_origins_are_dropped ... ok
2026-07-31T04:44:40.6759728Z test presence::tests::mra_degrades_to_local_and_skips_noise_rows ... ok
2026-07-31T04:44:40.6878957Z test presence::tests::snapshot_loading_degrades_on_junk ... ok
2026-07-31T04:44:40.6984618Z test presence::tests::mra_joins_local_and_gossiped_legs_under_one_max ... ok
2026-07-31T04:44:40.7509920Z test presence::tests::subnet_scope_gates_both_legs ... ok
2026-07-31T04:44:40.7691898Z test notif::tests::first_fire_declines_an_already_expired_row ... ok
2026-07-31T04:44:40.7790031Z test projwriter::tests::cold_construct_spawns_no_git_and_first_cycle_publishes ... ok
2026-07-31T04:44:40.7987843Z test projwriter::tests::corrupt_index_is_repaired_and_counted ... ok
2026-07-31T04:44:40.9868271Z test notif::tests::first_fire_reaches_most_recent_visible_endpoint ... ok
2026-07-31T04:44:41.2229972Z test notif::tests::notif_command_renders_all_keys_and_is_opt_in ... ok
2026-07-31T04:44:41.2327039Z test notif::tests::first_fire_redirects_to_a_fresher_remote_winner_unmarked ... ok
2026-07-31T04:44:41.4248569Z test notif::tests::first_fire_rides_the_quiet_window_not_the_live_stream ... ok
2026-07-31T04:44:41.5848916Z test notif::tests::hidden_endpoint_boundary_surfaces_nothing ... ok
2026-07-31T04:44:41.7910097Z test notif::tests::hidden_endpoint_is_never_the_target ... ok
2026-07-31T04:44:41.7911534Z test propagate::tests::classifier_maps_every_status_shape ... ok
2026-07-31T04:44:41.8640547Z test notif::tests::no_live_endpoint_is_a_typed_no_target ... ok
2026-07-31T04:44:42.0264652Z test notif::tests::node_scoped_first_fire_ignores_a_fresher_remote_winner ... ok
2026-07-31T04:44:42.3168581Z test notif::tests::resurface_delivers_undismissed_with_gates ... ok
2026-07-31T04:44:42.5811505Z test notif::tests::rollback_notif_is_loud_and_resurfaces ... ok
2026-07-31T04:44:43.9586359Z test notif::tests::shell_notif_templates_render_for_attached_instances_only ... ok
2026-07-31T04:44:44.3491244Z test notif::tests::suppression_window_holds_cross_endpoint ... ok
2026-07-31T04:44:44.4098551Z test pairhost::tests::an_advisory_records_the_sighting_and_still_applies_nothing ... ok
2026-07-31T04:44:49.3183507Z test projwriter::tests::cwd_invalidation_evicts_shared_cache_entry ... ok
2026-07-31T04:44:49.3185289Z test pump::health::tests::degraded_on_all_peer_failure_healthy_only_on_real_progress ... ok
2026-07-31T04:44:49.3301162Z test pump::health::tests::health_file_roundtrip_and_degrade ... ok
2026-07-31T04:44:49.3379610Z test pump::health::tests::registry_admit_stamp_survives_restart_rounds_and_never_regresses ... ok
2026-07-31T04:44:49.3380965Z test pump::health::tests::stage_parses_from_attributed_reasons ... ok
2026-07-31T04:44:59.9723447Z test projwriter::tests::ordinary_commit_is_noop_config_change_rederives ... ok
2026-07-31T04:45:00.8652605Z test projwriter::tests::writer_thread_debounces_burst_into_one_cycle ... ok
2026-07-31T04:45:03.7312912Z test psyrelay::tests::empty_and_oversize_bodies_drop_typed ... ok
2026-07-31T04:45:03.8145731Z test pump::registry::tests::fire_due_rotations_rotates_due_and_leaves_pending ... ok
2026-07-31T04:45:03.8155945Z test pump::registry::tests::poll_wake_takes_the_advertise_marker_exactly_once ... ok
2026-07-31T04:45:06.8385977Z test psyrelay::tests::notify_reaches_own_user_only ... ok
2026-07-31T04:45:06.8392569Z test pump::tests::choreography_fan_targets_skips_detached_and_self ... ok
2026-07-31T04:45:06.8394071Z test pump::tests::choreography_first_tick_primes_all_legs ... ok
2026-07-31T04:45:06.8395614Z test pump::tests::choreography_mark_after_round_stamps_only_due ... ok
2026-07-31T04:45:06.8397030Z test pump::tests::choreography_peer_step_aborts_on_first_failure ... ok
2026-07-31T04:45:06.8398813Z test pump::tests::choreography_pre_round_once_and_before_any_peer_step ... ok
2026-07-31T04:45:06.8400194Z test pump::tests::choreography_wake_forces_only_that_worker ... ok
2026-07-31T04:45:06.8401668Z test pump::tests::drain_read_classifies_dead_carrier_as_restart_timeout_as_quiet ... ok
2026-07-31T04:45:06.8402780Z test pump::tests::first_tick_is_due_and_never_underflows ... ok
2026-07-31T04:45:06.8695111Z test pump::tests::heartbeat_writes_and_advances ... ok
2026-07-31T04:45:06.8696813Z test pump::tests::peer_leg_outcome_isolates_ordinary_backs_off_carrier_timeout_still_poisons ... ok
2026-07-31T04:45:06.8698292Z test pump::tests::per_peer_backoff_doubles_caps_and_eligibility ... ok
2026-07-31T04:45:06.8704780Z test pump::tests::presence_state_effect_correlates_and_isolates ... ok
2026-07-31T04:45:06.8950894Z test pump::tests::push_feed_retires_its_own_row_after_successful_fin ... ok
2026-07-31T04:45:06.8953169Z test pump::tests::push_target_is_the_full_roster_minus_self_and_tombstoned ... ok
2026-07-31T04:45:06.9087709Z test pump::tests::resolve_submit_addr_walks_the_route_chain ... ok
2026-07-31T04:45:06.9217655Z test pump::tests::startup_reconcile_heals_suspect_rows_and_migrates_invalid_ones ... ok
2026-07-31T04:45:06.9218639Z test pump::tests::supervisor_backoff_doubles_caps_and_resets ... ok
2026-07-31T04:45:06.9524888Z test pump::tests::supervisor_restarts_a_panicking_pump_until_stop ... ok
2026-07-31T04:45:06.9525915Z test pump::tests::wake_forces_a_round_regardless_of_cadence ... ok
2026-07-31T04:45:06.9527339Z test pump::update::tests::advertised_version_finds_dotted_tokens_and_refuses_counter_shapes ... ok
2026-07-31T04:45:06.9528673Z test pump::update::tests::the_retire_predicate_keeps_ahead_and_unparseable_rows ... ok
2026-07-31T04:45:06.9529874Z test pump::update::tests::version_ge_compares_dotted_versions_and_rejects_garbage ... ok
2026-07-31T04:45:10.1828355Z test psyrelay::tests::notify_without_live_endpoint_is_pending ... ok
2026-07-31T04:45:10.1829625Z test reap::tests::reap_without_enroll_is_noop ... ok
2026-07-31T04:45:10.1831089Z test reconcile::tests::active_node_wins ... ok
2026-07-31T04:45:10.1832478Z test reconcile::tests::double_active_tiebreaks_deterministically ... ok
2026-07-31T04:45:10.1834108Z test reconcile::tests::fallback_lowest_non_offline ... ok
2026-07-31T04:45:10.1835319Z test reconcile::tests::no_rows_reconciles_locally ... ok
2026-07-31T04:45:10.2142325Z test registryhost::tests::admitted_feeds_stamp_the_heard_map ... ok
2026-07-31T04:45:11.1769253Z test reap::tests::job_reaps_enrolled_child_and_grandchild ... ok
2026-07-31T04:45:11.4872799Z test psyrelay::tests::null_stdout_driver_fails_the_guard ... ok
2026-07-31T04:45:13.8781416Z test psyrelay::tests::prose_only_relays_nothing ... ok
2026-07-31T04:45:14.0576642Z test registryhost::tests::advertised_status_splits_unbound_warm_from_cold_suspended ... ok
2026-07-31T04:45:16.7244957Z test psyrelay::tests::reply_without_target_is_dropped ... ok
2026-07-31T04:45:18.3024551Z test psyrelay::tests::spoofed_routing_is_stripped_and_restamped ... ok
2026-07-31T04:45:18.3047838Z test pump::registry::tests::disclosable_lines_keeps_the_per_subnet_filter ... ok
2026-07-31T04:45:18.3235329Z test registryhost::tests::apply_feed_batch_writes_snapshots_once_with_per_kind_semantics_parity ... ok
2026-07-31T04:45:18.3265690Z test pump::registry::tests::disclosable_lines_pushes_the_engine_room_only_to_its_chosen_viewer ... ok
2026-07-31T04:45:18.3376478Z test registryhost::tests::apply_feed_gates_and_merges_under_the_lease ... ok
2026-07-31T04:45:18.3393005Z test pump::registry::tests::discover_gate_filters_the_advert_push_per_viewer ... ok
2026-07-31T04:45:18.3452171Z test registryhost::tests::apply_feed_flips_only_on_observed_transition_to_active ... ok
2026-07-31T04:45:18.3564078Z test registryhost::tests::evict_aged_offline_rows_reaps_ghosts_and_rewrites_snapshots ... ok
2026-07-31T04:45:18.3578034Z test registryhost::tests::apply_node_labels_gates_and_merges ... ok
2026-07-31T04:45:18.3681098Z test registryhost::tests::evict_silent_peers_drops_unheard_rows_and_rewrites_snapshots ... ok
2026-07-31T04:45:18.3682366Z test registryhost::tests::gossip_controller_node_covers_any_controller ... ok
2026-07-31T04:45:18.3685692Z test registryhost::tests::recent_projects_cap_fires_on_output_length_not_scanned_rows ... ok
2026-07-31T04:45:18.3688191Z test registryhost::tests::recent_projects_derive_once_per_distinct_cwd ... ok
2026-07-31T04:45:18.4418530Z test pump::registry::tests::pre_round_sweeps_and_refreshes_adverts_each_round ... ok
2026-07-31T04:45:18.4680106Z test registryhost::tests::repair_evict_tombstones_roster_snapshot_and_notices ... ok
2026-07-31T04:45:18.4681203Z test registryhost::tests::superseded_requires_label_and_machine_id_under_other_key ... ok
2026-07-31T04:45:18.5095714Z test registryhost::tests::advertise_local_scans_and_respects_visibility ... ok
2026-07-31T04:45:18.5160544Z test registryhost::tests::with_epoch_is_the_one_canonical_counter ... ok
2026-07-31T04:45:18.5436065Z test registryhost::tests::advertise_local_stamps_the_node_label ... ok
2026-07-31T04:45:18.5695074Z test registryhost::tests::advertised_status_ignores_host_error ... ok
2026-07-31T04:45:21.1234368Z test psyrelay::tests::reply_relays_to_inbound_sender ... ok
2026-07-31T04:45:21.3286388Z test registryhost::tests::advertisement_carries_both_authored_blurb ... ok
2026-07-31T04:45:21.3286932Z test registryhost::tests::advertisement_carries_the_presence_datum ... ok
2026-07-31T04:45:21.3569495Z test relcache::tests::docs_bundle_stages_loads_and_clears_independently ... ok
2026-07-31T04:45:21.3619173Z test relcache::tests::applied_state_two_phase_round_trips_and_degrades ... ok
2026-07-31T04:45:21.3619793Z test relcache::tests::partial_update_set_can_serve_held_platform_only ... ok
2026-07-31T04:45:21.3886608Z test relcache::tests::torn_or_corrupt_stage_offers_nothing ... ok
2026-07-31T04:45:21.3887118Z test relcache::tests::stage_round_trips_and_restage_replaces ... ok
2026-07-31T04:45:21.3991559Z test relcache::tests::single_platform_stamp_is_explicit_and_cleared_on_restage ... ok
2026-07-31T04:45:21.4035264Z test release::tests::artifact_digest_mismatch_is_rejected ... ok
2026-07-31T04:45:21.4067573Z test release::tests::builtin_keys_merge_and_revoke_under_file_overlay ... ok
2026-07-31T04:45:21.4120613Z test release::tests::current_platform_is_registered_or_unknown ... ok
2026-07-31T04:45:21.4122155Z test release::tests::docs_entry_is_additive_and_verifies_exact_bytes ... ok
2026-07-31T04:45:21.4122558Z test release::tests::channel_mismatch_is_rejected ... ok
2026-07-31T04:45:21.4135862Z test release::tests::hex_roundtrips ... ok
2026-07-31T04:45:21.4148881Z test relcache::tests::update_set_round_trips_and_loads_by_platform ... ok
2026-07-31T04:45:21.4149616Z test release::tests::known_triples_project_the_registry ... ok
2026-07-31T04:45:21.4941071Z test release::tests::expired_metadata_is_rejected ... ok
2026-07-31T04:45:21.4941657Z test registryhost::tests::advertisement_follows_resting_transitions_epoch_bumped ... ok
2026-07-31T04:45:21.4955209Z test release::tests::musl_platform_registered ... ok
2026-07-31T04:45:21.4956157Z test release::tests::revoked_key_is_rejected ... ok
2026-07-31T04:45:21.5014378Z test release::tests::shipped_builtin_table_is_well_formed ... ok
2026-07-31T04:45:21.5078425Z test release::tests::production_policy_loads_fail_closed ... ok
2026-07-31T04:45:21.5179173Z test registryhost::tests::erased_perch_is_advertised_offline_not_left_active ... ok
2026-07-31T04:45:21.5314630Z test release::tests::update_set_artifact_mismatch_is_rejected ... ok
2026-07-31T04:45:21.5315269Z test release::tests::tampered_metadata_fails_signature ... ok
2026-07-31T04:45:21.5315700Z test release::tests::non_monotonic_version_is_rollback ... ok
2026-07-31T04:45:21.5316213Z test release::tests::untrusted_key_is_unknown ... ok
2026-07-31T04:45:21.5316645Z test release::tests::update_set_missing_platform_is_typed_rejection ... ok
2026-07-31T04:45:21.5317456Z test release::tests::update_set_tampering_breaks_whole_set_signature ... ok
2026-07-31T04:45:21.5332074Z test release::tests::update_set_channel_and_rollback_gates_hold ... ok
2026-07-31T04:45:21.5378931Z test release::tests::valid_release_verifies_and_artifact_matches ... ok
2026-07-31T04:45:21.5379895Z test release::tests::update_set_verifies_and_selects_platform_artifact ... ok
2026-07-31T04:45:21.5383251Z test resting::tests::apply_event_miss_message_is_single_sourced ... ok
2026-07-31T04:45:21.5636363Z test release::tests::verify_detached_signs_raw_artifact_bytes ... ok
2026-07-31T04:45:21.5948492Z test resting::tests::apply_event_no_spurious_echo_on_cold_void_suspend ... ok
2026-07-31T04:45:21.5950478Z test resting::tests::auto_suspend_counts_from_dormancy_onset_and_is_opt_in ... ok
2026-07-31T04:45:21.6025656Z test resting::tests::apply_event_echo_failure_is_loud_but_state_persists ... ok
2026-07-31T04:45:21.6048879Z test registryhost::tests::evict_silent_peers_never_touches_own_rows ... ok
2026-07-31T04:45:21.6068286Z test resting::tests::effective_rest_state_table ... ok
2026-07-31T04:45:21.6356057Z test resting::tests::freshness_pull_marker_is_taken_exactly_once ... ok
2026-07-31T04:45:21.6357069Z test resting::tests::knob_chain_resolves_global_node_endpoint ... ok
2026-07-31T04:45:21.6433556Z test resting::tests::apply_event_wakes_a_cold_void_perch ... ok
2026-07-31T04:45:21.6657281Z test resting::tests::apply_event_fires_echo_once_per_rest_edge_and_wake_on_wake ... ok
2026-07-31T04:45:21.6659658Z test resting::tests::route_rest_event_contract_table ... ok
2026-07-31T04:45:21.7025075Z test projwriter::tests::failed_cycle_preserves_last_known_good ... ok
2026-07-31T04:45:21.7026356Z test resting::tests::transition_table_matches_the_context_model ... ok
2026-07-31T04:45:21.7029999Z test rollback_compat::tests::pre_ready_durable_files_are_additive_and_n1_readable ... ok
2026-07-31T04:45:21.7239766Z test resting::tests::deferred_held_keys_on_the_durable_rest_record ... ok
2026-07-31T04:45:21.7240328Z test resting::tests::apply_event_auto_suspends_under_the_resolved_chain ... ok
2026-07-31T04:45:21.7420796Z test resting::tests::rest_record_round_trips_with_anchor_discipline ... ok
2026-07-31T04:45:21.7422030Z test resting::tests::suspend_with_broker_liveness_hint_edges_instead_of_no_edge ... ok
2026-07-31T04:45:21.7437926Z test registryhost::tests::the_engine_room_is_absent_from_the_advertisement_until_it_chooses_a_viewer ... ok
2026-07-31T04:45:21.7442161Z test seedproofx::grace_tests::grade_truth_table ... ok
2026-07-31T04:45:21.7450157Z test seedproofx::grace_tests::seed_never_appears_in_roster_gossip ... ok
2026-07-31T04:45:21.7460309Z test seedproofx::grace_tests::seedxfer_frame_round_trips_and_rejects_malformed ... ok
2026-07-31T04:45:21.7463087Z test seedproofx::roster_tests::admin_seed_rides_as_prefixed_sibling_and_routes_to_its_own_seam ... ok
2026-07-31T04:45:21.7466320Z test seedproofx::roster_tests::empty_roster_frame_round_trips ... ok
2026-07-31T04:45:21.7467902Z test seedproofx::roster_tests::malformed_roster_frame_rejected ... ok
2026-07-31T04:45:21.7470097Z test seedproofx::roster_tests::reconcile_fills_absent_keeps_observed_and_skips_self ... ok
2026-07-31T04:45:21.7472522Z test seedproofx::roster_tests::reconcile_refuses_mismatch_and_repairs_invalid_rows ... ok
2026-07-31T04:45:21.7474463Z test seedproofx::roster_tests::reconcile_replaces_a_suspect_row_with_the_validated_roster_address ... ok
2026-07-31T04:45:21.7477036Z test seedproofx::roster_tests::roster_frame_round_trips ... ok
2026-07-31T04:45:21.9255916Z test relay::tests::relay_backlog_never_drains_active_only ... ok
2026-07-31T04:45:21.9257169Z test service::tests::plan_start_prefers_service_then_spawn_idempotent ... ok
2026-07-31T04:45:21.9258746Z test service::tests::plan_stop_routes_managed_then_ipc_then_noop ... ok
2026-07-31T04:45:21.9261072Z test service::tests::run_refused_only_when_windows_and_vanishing ... ok
2026-07-31T04:45:21.9261715Z test service::tests::stale_bare_logon_action_classification ... ok
2026-07-31T04:45:22.2191541Z test relay::tests::respawn_loses_no_spooled_message ... ok
2026-07-31T04:45:22.3751760Z test relay::tests::run_honors_stop ... ok
2026-07-31T04:45:22.3753303Z test servicehost::tests::a_healthy_run_resets_the_fast_exit_counter ... ok
2026-07-31T04:45:22.4575502Z test resting::tests::daemon_rest_event_arms_gate_at_rest_edge_only ... ok
2026-07-31T04:45:23.4646685Z test resting::tests::rest_edges_cascade_shells_with_divergence ... ok
2026-07-31T04:45:23.4651577Z test servicehost::tests::a_newer_daemons_status_row_degrades_instead_of_failing_the_whole_reply ... ok
2026-07-31T04:45:23.4976300Z test projwriter::tests::endpoint_events_patch_rows_and_drop_purged ... ok
2026-07-31T04:45:23.8376390Z test servicehost::tests::a_path_verified_orphan_is_reaped_and_confirmed_by_a_post_kill_read ... ok
2026-07-31T04:45:24.4479889Z test servicehost::tests::a_service_that_exits_instantly_latches_and_stops_relaunching ... ok
2026-07-31T04:45:26.5079357Z test projwriter::tests::warm_start_unchanged_generation_scans_nothing ... ok
2026-07-31T04:45:29.5222610Z test seedmap::tests::put_refreshes_existing ... ok
2026-07-31T04:45:29.5316859Z test seedmap::tests::put_then_take_consumes_once ... ok
2026-07-31T04:45:29.5383667Z test seedmap::tests::request_stop_barrier_holds_until_no_listener ... ok
2026-07-31T04:45:29.5447160Z test seedmap::tests::stop_op_acks_then_serve_returns ... ok
2026-07-31T04:45:29.5514754Z test seedmap::tests::take_absent_is_none ... ok
2026-07-31T04:45:29.5779388Z test serveprobe::tests::is_serving_subnet_honors_membership_and_detach ... ok
2026-07-31T04:45:29.5862322Z test servicehost::tests::a_bind_service_defers_at_boot_and_starts_at_its_bind ... ok
2026-07-31T04:45:30.2870970Z test servicehost::tests::a_boot_service_starts_once_and_the_next_sweep_reads_already_running ... ok
2026-07-31T04:45:30.3032040Z test servicehost::tests::adapter_dir_substitutes_as_one_argv_element_even_with_spaces ... ok
2026-07-31T04:45:30.3032685Z test servicehost::tests::a_stop_kills_the_child_and_re_reads_liveness_after_the_kill ... ok
2026-07-31T04:45:30.6200313Z test servicehost::tests::an_exit_under_an_engaged_hold_stands_down_quiesced_instead_of_latching ... ok
2026-07-31T04:45:30.6243014Z test servicehost::tests::a_startup_fault_carries_what_the_service_said_before_it_died ... ok
2026-07-31T04:45:30.6526719Z test servicehost::tests::an_orphan_pid_running_a_different_image_is_never_killed ... ok
2026-07-31T04:45:30.6527895Z test servicehost::tests::an_orphan_whose_image_cannot_be_verified_is_reported_not_killed ... ok
2026-07-31T04:45:30.6529298Z test servicehost::tests::backoff_doubles_and_saturates ... ok
2026-07-31T04:45:30.6530801Z test servicehost::tests::consecutive_fast_exits_latch_startup_fault_early ... ok
2026-07-31T04:45:30.6543440Z test servicehost::tests::empty_and_dead_orphan_records_read_apart ... ok
2026-07-31T04:45:30.6708580Z test servicehost::tests::ensure_supervised_is_one_instance_per_option_and_refuses_an_unclear_sweep ... ok
2026-07-31T04:45:30.6709747Z test servicehost::tests::hold_outranks_everything ... ok
2026-07-31T04:45:30.6711501Z test servicehost::tests::only_the_three_ruled_opportunities_clear_the_latch ... ok
2026-07-31T04:45:30.6712916Z test servicehost::tests::quiesce_engages_the_hold_before_placing_the_stop_marker ... ok
2026-07-31T04:45:31.0548258Z test servicehost::tests::a_held_option_is_refused_by_a_clearing_sweep_and_starts_only_when_the_hold_releases ... ok
2026-07-31T04:45:31.0549715Z test servicehost::tests::slow_crashes_latch_the_ordinary_give_up_not_startup_fault ... ok
2026-07-31T04:45:31.0551411Z test servicehost::tests::start_trigger_decides_which_opportunities_start_it ... ok
2026-07-31T04:45:31.7903654Z test servicehost::tests::a_silent_daemon_times_the_caller_out_instead_of_wedging_it ... ok
2026-07-31T04:45:31.8479040Z test registryhost::tests::recent_projects_for_dedups_newest_first_excludes_owlery ... ok
2026-07-31T04:45:32.1321034Z test servicehost::tests::a_latched_option_reports_the_captured_evidence_behind_its_latch ... ok
2026-07-31T04:45:32.4897254Z test servicehost::tests::a_service_that_exits_on_the_stop_marker_quiesces_cooperatively ... ok
2026-07-31T04:45:32.4907148Z test servicehost::tests::the_service_command_resolves_its_program_through_the_install_dir_helper ... ok
2026-07-31T04:45:32.4908651Z test servicehost::tests::the_service_spawn_scrubs_the_session_identity_env ... ok
2026-07-31T04:45:32.4915286Z test servicehost::tests::the_spawn_environment_carries_the_cli_capability ... ok
2026-07-31T04:45:32.4916355Z test servicehost::tests::the_spawn_environment_carries_the_per_option_identity ... ok
2026-07-31T04:45:33.5004954Z test servicehost::tests::a_service_that_ignores_the_stop_marker_is_force_killed_and_confirmed_dead ... ok
2026-07-31T04:45:33.5009017Z test servicehost::tests::a_soft_deregistered_adapters_service_never_starts_in_the_first_place ... ok
2026-07-31T04:45:33.5022379Z test servicehost::tests::a_status_read_mints_no_hold_flag_for_the_option_it_reports ... ok
2026-07-31T04:45:33.5036082Z test shellchan::tests::activity_frame_parses_back_through_the_public_decoder ... ok
2026-07-31T04:45:33.5042521Z test shellchan::tests::activity_frame_shape_is_the_published_one ... ok
2026-07-31T04:45:33.5048957Z test shellchan::tests::drive_frame_shape_mirrors_sensory ... ok
2026-07-31T04:45:33.5055696Z test shellchan::tests::frames_compose_and_stamp_roundtrips ... ok
2026-07-31T04:45:33.6358781Z test shellchan::tests::restamp_carries_pending_rows_across_rotation ... ok
2026-07-31T04:45:33.6360429Z test shellchan::tests::sensory_text_file_frames_shape ... ok
2026-07-31T04:45:33.6366202Z test shellchan::tests::vocab_check_bounds_ops_and_args ... ok
2026-07-31T04:45:33.6539020Z test shelldisc::tests::discover_across_joins_other_node_subnet_adapters ... ok
2026-07-31T04:45:33.6917773Z test shelldisc::tests::discovery_lists_a_dead_pid_instance_offline ... ok
2026-07-31T04:45:33.7574621Z test shelldisc::tests::discovery_own_plus_broadcast_gated_instantiable ... ok
2026-07-31T04:45:33.7814275Z test shelldisc::tests::shell_context_renders_sections_and_empties_to_none ... ok
2026-07-31T04:45:33.7817233Z test shellhost::tests::a_daemon_that_launches_is_the_only_launcher ... ok
2026-07-31T04:45:33.7820536Z test shellhost::tests::a_late_ack_loser_adopts_the_winner_instead_of_spawning ... ok
2026-07-31T04:45:33.7823495Z test shellhost::tests::a_post_ack_failure_never_spawns_again ... ok
2026-07-31T04:45:33.7826333Z test shellhost::tests::a_post_ack_silence_is_indeterminate_not_failure ... ok
2026-07-31T04:45:33.7831434Z test shellhost::tests::a_pre_ack_refusal_falls_back_in_process ... ok
2026-07-31T04:45:33.8530129Z test shellhost::tests::a_spawn_program_the_install_dir_does_not_ship_falls_through_to_path ... ok
2026-07-31T04:45:33.8577475Z test shellhost::tests::a_spawn_template_resolves_its_program_and_adapter_dir_against_the_install_dir ... ok
2026-07-31T04:45:33.8581288Z test shellhost::tests::an_answered_refusal_never_consults_the_arbiter ... ok
2026-07-31T04:45:33.8589133Z test shellhost::tests::an_unserved_socket_is_a_pre_ack_refusal ... ok
2026-07-31T04:45:34.2395716Z test servicehost::tests::the_startup_capture_is_reclaimed_once_the_run_proves_it_starts ... ok
2026-07-31T04:45:35.1015815Z test servicehost::tests::a_stood_down_supervisors_latch_outlives_its_thread_and_suppresses_the_next_sweep ... ok
2026-07-31T04:45:36.4019163Z test servicehost::tests::a_supervised_option_no_longer_declared_still_appears_as_undeclared ... ok
2026-07-31T04:45:36.7021761Z test shellhost::tests::gateway_typed_owner_spawns_and_owns_a_shell ... ok
2026-07-31T04:45:37.1250796Z test shellhost::tests::close_shell_dead_child_is_prompt_and_manifestless_never_erases ... ok
2026-07-31T04:45:37.1259228Z test shellhost::tests::close_shell_ephemeral_tears_down_and_frees_the_slot ... ok
2026-07-31T04:45:37.1286097Z test shellhost::tests::link_key_and_frame_mac_roundtrip ... ok
2026-07-31T04:45:37.1286812Z test shellhost::tests::close_shell_delivers_pre_close_then_kills_and_flips_offline ... ok
2026-07-31T04:45:37.1291839Z test shellhost::tests::only_the_relay_receipt_routes_through_the_daemon ... ok
2026-07-31T04:45:37.1528447Z test servicehost::tests::a_supervisor_whose_declaration_is_gone_is_torn_down_by_the_next_sweep ... ok
2026-07-31T04:45:37.1640748Z test shellhost::tests::spawn_template_perch_dir_fills_as_one_argv_element ... ok
2026-07-31T04:45:37.1647290Z test shellhost::tests::the_arbiter_does_not_block_an_uncontested_fallback ... ok
2026-07-31T04:45:37.1668858Z test shellhost::tests::only_a_live_recorded_pid_wins_a_launch_race ... ok
2026-07-31T04:45:37.1669517Z test shellwake::tests::backoff_curve_doubles_to_the_cap ... ok
2026-07-31T04:45:37.1718224Z test shellwake::tests::a_wake_template_resolves_its_program_and_adapter_dir_against_the_install_dir ... ok
2026-07-31T04:45:37.1848898Z test shellhost::tests::spawn_template_without_perch_dir_is_unchanged ... ok
2026-07-31T04:45:37.2070322Z test shellhost::tests::launch_fails_closed_on_bad_templates ... ok
2026-07-31T04:45:37.2349663Z test shellwake::tests::reconcile_never_adopts_a_stale_online_instance ... ok
2026-07-31T04:45:37.2388878Z test shellwake::tests::resolve_wake_refuses_without_a_reachable_owner ... ok
2026-07-31T04:45:37.2539500Z test shellwake::tests::reconcile_resolves_profile_overlay ... ok
2026-07-31T04:45:37.2545746Z test shellwake::tests::the_wake_catalog_shares_the_spawn_vocabulary_but_is_not_the_same_set ... ok
2026-07-31T04:45:37.3562815Z test servicehost::tests::an_adapter_scoped_sweep_neither_starts_nor_stops_another_adapters_service ... ok
2026-07-31T04:45:37.3828189Z test servicehost::tests::an_unknown_op_closes_the_connection_instead_of_wedging_the_caller ... ok
2026-07-31T04:45:37.3834200Z test servicehost::tests::quiesce_raises_the_hold_before_it_can_place_any_stop_marker ... ok
2026-07-31T04:45:37.3916254Z test stderrlog::tests::roll_keeps_bounded_generations_and_preserves_current ... ok
2026-07-31T04:45:37.3929304Z test stderrlog::tests::roll_with_keep_one_clears_without_backup ... ok
2026-07-31T04:45:37.3935417Z test stderrlog::tests::should_roll_at_or_over_cap_only ... ok
2026-07-31T04:45:37.3935832Z test sync::tests::gate_decision_table ... ok
2026-07-31T04:45:37.3998838Z test servicehost::tests::the_advisory_line_is_read_bounded_and_never_dressed_up_when_absent ... ok
2026-07-31T04:45:37.4672117Z test shellwake::tests::resolve_wake_leaves_a_dormant_owner_and_relaunches ... ok
2026-07-31T04:45:37.5415377Z test shellhost::tests::launch_parks_token_and_bind_by_token_onlines ... ok
2026-07-31T04:45:37.5422318Z test translation::tests::inject_floor_buffers_while_held_then_drains_in_order ... ok
2026-07-31T04:45:37.5423779Z test translation::tests::key_cmd_parses_each_wire_shape ... ok
2026-07-31T04:45:37.5425199Z test translation::tests::key_to_bytes_send_keys_map ... ok
2026-07-31T04:45:37.5427006Z test translation::tests::to_binary_serializes_to_wire_and_input_is_content_free ... ok
2026-07-31T04:45:37.5432594Z test transport::tests::local_socket_handshake_and_frame_round_trip ... ok
2026-07-31T04:45:37.5436216Z test transport::tests::local_socket_rejects_wrong_role ... ok
2026-07-31T04:45:37.5437598Z test tunnelhub::tests::clear_evicts_the_entry ... ok
2026-07-31T04:45:37.5439440Z test tunnelhub::tests::dead_generation_stream_is_never_surfaced ... ok
2026-07-31T04:45:37.5441183Z test tunnelhub::tests::entries_are_per_owner ... ok
2026-07-31T04:45:37.5443198Z test tunnelhub::tests::relink_overwrites_the_entry_with_a_fresh_generation ... ok
2026-07-31T04:45:37.5444814Z test tunnelhub::tests::resolve_serves_each_end_under_the_opening_token ... ok
2026-07-31T04:45:37.5447055Z test update::tests::apply_refuses_non_brain_only_plan ... ok
2026-07-31T04:45:37.5448843Z test update::tests::classify_brain_only_when_broker_hosts_new_brain ... ok
2026-07-31T04:45:37.5452506Z test update::tests::classify_broker_breaking_on_resource_abi_change ... ok
2026-07-31T04:45:37.5453223Z test update::tests::classify_broker_compatible_when_brain_below_floor ... ok
2026-07-31T04:45:37.5635333Z test update::tests::plan_verified_produces_no_plan_for_a_rejected_release ... ok
2026-07-31T04:45:37.5902283Z test update::tests::plan_verified_update_set_uses_selected_platform_spec ... ok
2026-07-31T04:45:37.5994944Z test update::tests::plan_verified_yields_a_plan_for_a_valid_release ... ok
2026-07-31T04:45:37.9194262Z test servicehost::tests::the_hold_outlives_the_force_killed_supervision_it_ended ... ok
2026-07-31T04:45:37.9196057Z test wan::tests::origin_user_backed_matrix ... ok
2026-07-31T04:45:38.4016595Z test shellwake::tests::watcher_opcode_exit_fires_resolution_once ... ok
2026-07-31T04:45:38.4018125Z test wan::tests::wan_ingress_empty_from_renders_origin_node_label ... ok
2026-07-31T04:45:38.4019451Z test wan::tests::wan_outcome_token_round_trips_and_unknown_is_noreply ... ok
2026-07-31T04:45:38.4021090Z test wan::tests::wan_user_msg_restamped_unless_origin_user_backed ... ok
2026-07-31T04:45:38.4237354Z test xfer::tests::recv_state_chunks_idempotent_and_commit_replays_safely ... ok
2026-07-31T04:45:38.4239061Z test xfer::tests::resolve_under_confines_to_root ... ok
2026-07-31T04:45:38.4983326Z test servicehost::tests::the_projection_reports_a_live_supervisor_with_its_declaration_and_advisory ... ok
2026-07-31T04:45:38.4993834Z test servicehost::tests::the_projection_scopes_to_one_adapter_and_keeps_deregistered_declarations ... ok
2026-07-31T04:45:38.5090499Z test servicehost::tests::the_status_op_reports_over_the_wire_and_starts_nothing ... ok
2026-07-31T04:45:39.6633792Z test servicehost::tests::the_stop_marker_is_never_visible_before_the_hold_is_up ... ok
2026-07-31T04:45:39.7004762Z test translation::tests::flagged_spawn_still_starts ... ok
2026-07-31T04:45:39.8575872Z test shellwake::tests::reconcile_flips_watchers_with_instance_state ... ok
2026-07-31T04:45:40.7097043Z test projwriter::tests::batched_complexity_counters_hold has been running for over 60 seconds
2026-07-31T04:45:41.2226105Z test shellwake::tests::resolve_wake_revives_a_suspended_owner_without_double_launch ... ok
2026-07-31T04:45:41.2301545Z test stderrlog::tests::path_under_home_and_stamp_is_legible ... ok
2026-07-31T04:45:41.2362367Z test projwriter::tests::parity_full_ordered_list_vs_legacy_oracle has been running for over 60 seconds
2026-07-31T04:45:41.4137856Z test wan::tests::no_binary_wan_arrival_spools_not_pty ... ok
2026-07-31T04:45:41.4250031Z test wan::tests::the_stamp_not_the_from_is_the_sender_subject ... ok
2026-07-31T04:45:43.9810161Z test shellwake::tests::watcher_crash_exits_respawn_then_give_up ... ok
2026-07-31T04:46:03.1217662Z test sync::tests::reconcile_driver_structurally_excludes_live_role ... ok
2026-07-31T04:46:05.6001061Z test projwriter::tests::batched_complexity_counters_hold ... ok
2026-07-31T04:46:15.1256342Z test sync::tests::select_refs_scopes_two_tiers ... ok
2026-07-31T04:46:25.3141290Z test projwriter::tests::parity_full_ordered_list_vs_legacy_oracle ... ok
2026-07-31T04:46:25.3141659Z 
2026-07-31T04:46:25.3141733Z failures:
2026-07-31T04:46:25.3142918Z 
2026-07-31T04:46:25.3143883Z ---- daemon::tests::a_captured_spawn_inherits_only_the_handle_in_its_allowlist stdout ----
2026-07-31T04:46:25.3145301Z DETACH_BREAKAWAY_DENIED: the Job Object of the LAUNCHING process (spt_daemon-4d86a85ce347685e.exe pid=35272) forbids breakaway; spawned IN-JOB — the child belongs to THAT job and dies with it
2026-07-31T04:46:25.3145991Z 
2026-07-31T04:46:25.3146418Z thread 'daemon::tests::a_captured_spawn_inherits_only_the_handle_in_its_allowlist' (34016) panicked at crates\spt-daemon\src\daemon.rs:2166:9:
2026-07-31T04:46:25.3147374Z the child inherited a handle that was NOT in the allowlist — the allowlist is not doing the job that makes bInheritHandles = TRUE safe here
2026-07-31T04:46:25.3147838Z 
2026-07-31T04:46:25.3147842Z 
2026-07-31T04:46:25.3147915Z failures:
2026-07-31T04:46:25.3148188Z     daemon::tests::a_captured_spawn_inherits_only_the_handle_in_its_allowlist
2026-07-31T04:46:25.3148463Z 
2026-07-31T04:46:25.3148710Z test result: FAILED. 722 passed; 1 failed; 0 ignored; 0 measured; 0 filtered out; finished in 140.93s
2026-07-31T04:46:25.3149052Z 
2026-07-31T04:46:25.3236258Z error: test failed, to rerun pass `-p spt-daemon --lib`
2026-07-31T04:46:25.3826048Z ##[error]Process completed with exit code 1.
2026-07-31T04:46:25.4806313Z Post job cleanup.
2026-07-31T04:46:26.0642486Z [command]"C:\Program Files\Git\cmd\git.exe" version
2026-07-31T04:46:26.6512669Z git version 2.43.0.windows.1
2026-07-31T04:46:26.6556813Z Copying 'C:\Users\decid\.gitconfig' to 'C:\actions-runner\_work\_temp\aedc38ec-a6b4-4a50-8271-a3462f0bf8ff\.gitconfig'
2026-07-31T04:46:26.6573999Z Temporarily overriding HOME='C:\actions-runner\_work\_temp\aedc38ec-a6b4-4a50-8271-a3462f0bf8ff' before making global git config changes
2026-07-31T04:46:26.6575004Z Adding repository directory to the temporary git global config as a safe directory
2026-07-31T04:46:26.6586810Z [command]"C:\Program Files\Git\cmd\git.exe" config --global --add safe.directory C:\actions-runner\_work\spt-bs-core\spt-bs-core
2026-07-31T04:46:28.3651778Z [command]"C:\Program Files\Git\cmd\git.exe" config --local --name-only --get-regexp core\.sshCommand
2026-07-31T04:46:28.8780083Z [command]"C:\Program Files\Git\cmd\git.exe" submodule foreach --recursive "sh -c \"git config --local --name-only --get-regexp 'core\.sshCommand' && git config --local --unset-all 'core.sshCommand' || :\""
2026-07-31T04:46:46.5861074Z [command]"C:\Program Files\Git\cmd\git.exe" config --local --name-only --get-regexp http\.https\:\/\/github\.com\/\.extraheader
2026-07-31T04:46:46.9889879Z http.https://github.com/.extraheader
2026-07-31T04:46:46.9968844Z [command]"C:\Program Files\Git\cmd\git.exe" config --local --unset-all http.https://github.com/.extraheader
2026-07-31T04:46:47.3370959Z [command]"C:\Program Files\Git\cmd\git.exe" submodule foreach --recursive "sh -c \"git config --local --name-only --get-regexp 'http\.https\:\/\/github\.com\/\.extraheader' && git config --local --unset-all 'http.https://github.com/.extraheader' || :\""
2026-07-31T04:46:55.8868250Z [command]"C:\Program Files\Git\cmd\git.exe" config --local --name-only --get-regexp ^includeIf\.gitdir:
2026-07-31T04:46:55.9355651Z [command]"C:\Program Files\Git\cmd\git.exe" submodule foreach --recursive "git config --local --show-origin --name-only --get-regexp remote.origin.url"
2026-07-31T04:47:06.9282532Z Cleaning up orphan processes
